{"text_format":"1","workbook":"xlsx","n_sheets":7,"sheets":["Resumo","Contratos em Aberto DI","Curva de Juros Pré","ETTJ x Contratos em Aberto","Anbima LTN","Legendas","Feriados"],"not_rendered":{"charts":4,"images":1,"macros":1,"external_links":0,"defined_names":0,"comments":0,"pivot_tables":0},"unopened":[],"bounds":{"document_bytes":16777216,"sheet_cells":100000,"rows_first":2000,"rows_last":500,"rows_between":2000,"halvings":0,"cell_chars":16384,"cell_head_chars":4096},"cells_cut":0,"cells_raw":0,"read":"whole","date_system":"1900"}

{"sheet":"Resumo","index":0,"n_rows":41,"n_cols":10,"rows_kept":41,"cut":false,"hidden":false,"merged":[]}
[]
[null,"Série","Mês","Data","Preços","Dias","Taxa","Contratos","Variação","DV01"]
[null,null,"Vencimento","Vencimento","Futuros","Úteis","Pré","em Aberto","Quantidade"]
[null,{"$f":"'Contratos em Aberto DI'!A2","v":"Q22"},{"$f":"VLOOKUP(MID(B4,1,1),Legendas!$B$8:$D$19,2,FALSE)","v":"Agosto"},{"$f":"WORKDAY(EOMONTH(\"15/\"&VLOOKUP(MID(B4,1,1),Legendas!$B$8:$D$19,3,FALSE)&\"/\"&\"20\"&RIGHT(B4,2),-1),1,Feriados!$A$2:$A$937)","v":"2022-08-01"},{"$f":"100000/(1+G4)^(F4/252)","v":99706.279381506698},{"$f":"NETWORKDAYS('Curva de Juros Pré'!$B$1,D4,Feriados!$A$2:$A$937)-1","v":6},{"$f":"InterpolaPre(F4)","v":0.13149999999999706},{"$f":"VLOOKUP(B4,'Contratos em Aberto DI'!$A$2:$C$40,2,FALSE)","v":742547},{"$f":"VLOOKUP(B4,'Contratos em Aberto DI'!$A$2:$C$40,3,FALSE)","v":0},{"$f":"100000/(1+G4+0.01%)^(F4/252)-100000/(1+G4)^(F4/252)","v":-0.20979687481303699}]
[null,{"$f":"'Contratos em Aberto DI'!A3","v":"U22"},{"$f":"VLOOKUP(MID(B5,1,1),Legendas!$B$8:$D$19,2,FALSE)","v":"Setembro"},{"$f":"WORKDAY(EOMONTH(\"15/\"&VLOOKUP(MID(B5,1,1),Legendas!$B$8:$D$19,3,FALSE)&\"/\"&\"20\"&RIGHT(B5,2),-1),1,Feriados!$A$2:$A$937)","v":"2022-09-01"},{"$f":"100000/(1+G5)^(F5/252)","v":98555.285123036432},{"$f":"NETWORKDAYS('Curva de Juros Pré'!$B$1,D5,Feriados!$A$2:$A$937)-1","v":29},{"$f":"InterpolaPre(F5)","v":0.13479999999999936},{"$f":"VLOOKUP(B5,'Contratos em Aberto DI'!$A$2:$C$40,2,FALSE)","v":518765},{"$f":"VLOOKUP(B5,'Contratos em Aberto DI'!$A$2:$C$40,3,FALSE)","v":0},{"$f":"100000/(1+G5+0.01%)^(F5/252)-100000/(1+G5)^(F5/252)","v":-0.99939394101966172}]
[null,{"$f":"'Contratos em Aberto DI'!A4","v":"V22"},{"$f":"VLOOKUP(MID(B6,1,1),Legendas!$B$8:$D$19,2,FALSE)","v":"Outubro"},{"$f":"WORKDAY(EOMONTH(\"15/\"&VLOOKUP(MID(B6,1,1),Legendas!$B$8:$D$19,3,FALSE)&\"/\"&\"20\"&RIGHT(B6,2),-1),1,Feriados!$A$2:$A$937)","v":"2022-10-03"},97503.413797579095,{"$f":"NETWORKDAYS('Curva de Juros Pré'!$B$1,D6,Feriados!$A$2:$A$937)-1","v":50},{"$f":"InterpolaPre(F6)","v":0.13590000000000013},{"$f":"VLOOKUP(B6,'Contratos em Aberto DI'!$A$2:$C$40,2,FALSE)","v":2231457},{"$f":"VLOOKUP(B6,'Contratos em Aberto DI'!$A$2:$C$40,3,FALSE)","v":0},-1.7030456001666607]
[null,{"$f":"'Contratos em Aberto DI'!A5","v":"X22"},{"$f":"VLOOKUP(MID(B7,1,1),Legendas!$B$8:$D$19,2,FALSE)","v":"Novembro"},{"$f":"WORKDAY(EOMONTH(\"15/\"&VLOOKUP(MID(B7,1,1),Legendas!$B$8:$D$19,3,FALSE)&\"/\"&\"20\"&RIGHT(B7,2),-1),1,Feriados!$A$2:$A$937)","v":"2022-11-01"},96494.013911824019,{"$f":"NETWORKDAYS('Curva de Juros Pré'!$B$1,D7,Feriados!$A$2:$A$937)-1","v":70},{"$f":"InterpolaPre(F7)","v":0.1371},{"$f":"VLOOKUP(B7,'Contratos em Aberto DI'!$A$2:$C$40,2,FALSE)","v":325915},{"$f":"VLOOKUP(B7,'Contratos em Aberto DI'!$A$2:$C$40,3,FALSE)","v":0},-2.3570826537034009]
[null,{"$f":"'Contratos em Aberto DI'!A6","v":"Z22"},{"$f":"VLOOKUP(MID(B8,1,1),Legendas!$B$8:$D$19,2,FALSE)","v":"Dezembro"},{"$f":"WORKDAY(EOMONTH(\"15/\"&VLOOKUP(MID(B8,1,1),Legendas!$B$8:$D$19,3,FALSE)&\"/\"&\"20\"&RIGHT(B8,2),-1),1,Feriados!$A$2:$A$937)","v":"2022-12-01"},95488.086848661813,{"$f":"NETWORKDAYS('Curva de Juros Pré'!$B$1,D8,Feriados!$A$2:$A$937)-1","v":90},{"$f":"InterpolaPre(F8)","v":0.1379999999999999},{"$f":"VLOOKUP(B8,'Contratos em Aberto DI'!$A$2:$C$40,2,FALSE)","v":264213},{"$f":"VLOOKUP(B8,'Contratos em Aberto DI'!$A$2:$C$40,3,FALSE)","v":0},-2.9965601756848628]
[null,{"$f":"'Contratos em Aberto DI'!A7","v":"F23"},{"$f":"VLOOKUP(MID(B9,1,1),Legendas!$B$8:$D$19,2,FALSE)","v":"Janeiro"},{"$f":"WORKDAY(EOMONTH(\"15/\"&VLOOKUP(MID(B9,1,1),Legendas!$B$8:$D$19,3,FALSE)&\"/\"&\"20\"&RIGHT(B9,2),-1),1,Feriados!$A$2:$A$937)","v":"2023-01-02"},94394.380906448379,{"$f":"NETWORKDAYS('Curva de Juros Pré'!$B$1,D9,Feriados!$A$2:$A$937)-1","v":112},{"$f":"InterpolaPre(F9)","v":0.13859999999999983},{"$f":"VLOOKUP(B9,'Contratos em Aberto DI'!$A$2:$C$40,2,FALSE)","v":5413628},{"$f":"VLOOKUP(B9,'Contratos em Aberto DI'!$A$2:$C$40,3,FALSE)","v":0},-3.6843840908259153]
[null,{"$f":"'Contratos em Aberto DI'!A8","v":"G23"},{"$f":"VLOOKUP(MID(B10,1,1),Legendas!$B$8:$D$19,2,FALSE)","v":"Fevereiro"},{"$f":"WORKDAY(EOMONTH(\"15/\"&VLOOKUP(MID(B10,1,1),Legendas!$B$8:$D$19,3,FALSE)&\"/\"&\"20\"&RIGHT(B10,2),-1),1,Feriados!$A$2:$A$937)","v":"2023-02-01"},93313.339881165957,{"$f":"NETWORKDAYS('Curva de Juros Pré'!$B$1,D10,Feriados!$A$2:$A$937)-1","v":134},{"$f":"InterpolaPre(F10)","v":0.13900000000000001},{"$f":"VLOOKUP(B10,'Contratos em Aberto DI'!$A$2:$C$40,2,FALSE)","v":74540},{"$f":"VLOOKUP(B10,'Contratos em Aberto DI'!$A$2:$C$40,3,FALSE)","v":0},-4.356072169932304]
[null,{"$f":"'Contratos em Aberto DI'!A9","v":"H23"},{"$f":"VLOOKUP(MID(B11,1,1),Legendas!$B$8:$D$19,2,FALSE)","v":"Março"},{"$f":"WORKDAY(EOMONTH(\"15/\"&VLOOKUP(MID(B11,1,1),Legendas!$B$8:$D$19,3,FALSE)&\"/\"&\"20\"&RIGHT(B11,2),-1),1,Feriados!$A$2:$A$937)","v":"2023-03-01"},92444.978854987319,{"$f":"NETWORKDAYS('Curva de Juros Pré'!$B$1,D11,Feriados!$A$2:$A$937)-1","v":152},{"$f":"InterpolaPre(F11)","v":0.1391},{"$f":"VLOOKUP(B11,'Contratos em Aberto DI'!$A$2:$C$40,2,FALSE)","v":75897},{"$f":"VLOOKUP(B11,'Contratos em Aberto DI'!$A$2:$C$40,3,FALSE)","v":0},-4.8947888559778221]
[null,{"$f":"'Contratos em Aberto DI'!A10","v":"J23"},{"$f":"VLOOKUP(MID(B12,1,1),Legendas!$B$8:$D$19,2,FALSE)","v":"Abril"},{"$f":"WORKDAY(EOMONTH(\"15/\"&VLOOKUP(MID(B12,1,1),Legendas!$B$8:$D$19,3,FALSE)&\"/\"&\"20\"&RIGHT(B12,2),-1),1,Feriados!$A$2:$A$937)","v":"2023-04-03"},91313.640557849023,{"$f":"NETWORKDAYS('Curva de Juros Pré'!$B$1,D12,Feriados!$A$2:$A$937)-1","v":175},{"$f":"InterpolaPre(F12)","v":0.13979999999999992},{"$f":"VLOOKUP(B12,'Contratos em Aberto DI'!$A$2:$C$40,2,FALSE)","v":630865},{"$f":"VLOOKUP(B12,'Contratos em Aberto DI'!$A$2:$C$40,3,FALSE)","v":0},-5.5630406454438344]
[null,{"$f":"'Contratos em Aberto DI'!A11","v":"K23"},{"$f":"VLOOKUP(MID(B13,1,1),Legendas!$B$8:$D$19,2,FALSE)","v":"Maio"},{"$f":"WORKDAY(EOMONTH(\"15/\"&VLOOKUP(MID(B13,1,1),Legendas!$B$8:$D$19,3,FALSE)&\"/\"&\"20\"&RIGHT(B13,2),-1),1,Feriados!$A$2:$A$937)","v":"2023-05-02"},90458.063836124551,{"$f":"NETWORKDAYS('Curva de Juros Pré'!$B$1,D13,Feriados!$A$2:$A$937)-1","v":193},{"$f":"InterpolaPre(F13)","v":0.13989999999999991},{"$f":"VLOOKUP(B13,'Contratos em Aberto DI'!$A$2:$C$40,2,FALSE)","v":29478},{"$f":"VLOOKUP(B13,'Contratos em Aberto DI'!$A$2:$C$40,3,FALSE)","v":0},-6.0772018944844604]
[null,{"$f":"'Contratos em Aberto DI'!A12","v":"M23"},{"$f":"VLOOKUP(MID(B14,1,1),Legendas!$B$8:$D$19,2,FALSE)","v":"Junho"},{"$f":"WORKDAY(EOMONTH(\"15/\"&VLOOKUP(MID(B14,1,1),Legendas!$B$8:$D$19,3,FALSE)&\"/\"&\"20\"&RIGHT(B14,2),-1),1,Feriados!$A$2:$A$937)","v":"2023-06-01"},89423.203922256886,{"$f":"NETWORKDAYS('Curva de Juros Pré'!$B$1,D14,Feriados!$A$2:$A$937)-1","v":215},{"$f":"InterpolaPre(F14)","v":0.14000000000000012},{"$f":"VLOOKUP(B14,'Contratos em Aberto DI'!$A$2:$C$40,2,FALSE)","v":30150},{"$f":"VLOOKUP(B14,'Contratos em Aberto DI'!$A$2:$C$40,3,FALSE)","v":0},-6.6918777127430076]
[null,{"$f":"'Contratos em Aberto DI'!A13","v":"N23"},{"$f":"VLOOKUP(MID(B15,1,1),Legendas!$B$8:$D$19,2,FALSE)","v":"Julho"},{"$f":"WORKDAY(EOMONTH(\"15/\"&VLOOKUP(MID(B15,1,1),Legendas!$B$8:$D$19,3,FALSE)&\"/\"&\"20\"&RIGHT(B15,2),-1),1,Feriados!$A$2:$A$937)","v":"2023-07-03"},88437.571216330616,{"$f":"NETWORKDAYS('Curva de Juros Pré'!$B$1,D15,Feriados!$A$2:$A$937)-1","v":236},{"$f":"InterpolaPre(F15)","v":0.1402000000000001},{"$f":"VLOOKUP(B15,'Contratos em Aberto DI'!$A$2:$C$40,2,FALSE)","v":2172565},{"$f":"VLOOKUP(B15,'Contratos em Aberto DI'!$A$2:$C$40,3,FALSE)","v":0},-7.2632393155217869]
[null,{"$f":"'Contratos em Aberto DI'!A14","v":"V23"},{"$f":"VLOOKUP(MID(B16,1,1),Legendas!$B$8:$D$19,2,FALSE)","v":"Outubro"},{"$f":"WORKDAY(EOMONTH(\"15/\"&VLOOKUP(MID(B16,1,1),Legendas!$B$8:$D$19,3,FALSE)&\"/\"&\"20\"&RIGHT(B16,2),-1),1,Feriados!$A$2:$A$937)","v":"2023-10-02"},85610.752679513433,{"$f":"NETWORKDAYS('Curva de Juros Pré'!$B$1,D16,Feriados!$A$2:$A$937)-1","v":300},{"$f":"InterpolaPre(F16)","v":0.13939999999999997},{"$f":"VLOOKUP(B16,'Contratos em Aberto DI'!$A$2:$C$40,2,FALSE)","v":309489},{"$f":"VLOOKUP(B16,'Contratos em Aberto DI'!$A$2:$C$40,3,FALSE)","v":0},-8.9439851582428673]
[null,{"$f":"'Contratos em Aberto DI'!A15","v":"F24"},{"$f":"VLOOKUP(MID(B17,1,1),Legendas!$B$8:$D$19,2,FALSE)","v":"Janeiro"},{"$f":"WORKDAY(EOMONTH(\"15/\"&VLOOKUP(MID(B17,1,1),Legendas!$B$8:$D$19,3,FALSE)&\"/\"&\"20\"&RIGHT(B17,2),-1),1,Feriados!$A$2:$A$937)","v":"2024-01-02"},83084.366761196274,{"$f":"NETWORKDAYS('Curva de Juros Pré'!$B$1,D17,Feriados!$A$2:$A$937)-1","v":361},{"$f":"InterpolaPre(F17)","v":0.13810000000000011},{"$f":"VLOOKUP(B17,'Contratos em Aberto DI'!$A$2:$C$40,2,FALSE)","v":3745488},{"$f":"VLOOKUP(B17,'Contratos em Aberto DI'!$A$2:$C$40,3,FALSE)","v":0},-10.456808189366711]
[null,{"$f":"'Contratos em Aberto DI'!A16","v":"J24"},{"$f":"VLOOKUP(MID(B18,1,1),Legendas!$B$8:$D$19,2,FALSE)","v":"Abril"},{"$f":"WORKDAY(EOMONTH(\"15/\"&VLOOKUP(MID(B18,1,1),Legendas!$B$8:$D$19,3,FALSE)&\"/\"&\"20\"&RIGHT(B18,2),-1),1,Feriados!$A$2:$A$937)","v":"2024-04-01"},80653.524189092321,{"$f":"NETWORKDAYS('Curva de Juros Pré'!$B$1,D18,Feriados!$A$2:$A$937)-1","v":422},{"$f":"InterpolaPre(F18)","v":0.13700000000000001},{"$f":"VLOOKUP(B18,'Contratos em Aberto DI'!$A$2:$C$40,2,FALSE)","v":809212},{"$f":"VLOOKUP(B18,'Contratos em Aberto DI'!$A$2:$C$40,3,FALSE)","v":0},-11.877463829514454]
[null,{"$f":"'Contratos em Aberto DI'!A17","v":"N24"},{"$f":"VLOOKUP(MID(B19,1,1),Legendas!$B$8:$D$19,2,FALSE)","v":"Julho"},{"$f":"WORKDAY(EOMONTH(\"15/\"&VLOOKUP(MID(B19,1,1),Legendas!$B$8:$D$19,3,FALSE)&\"/\"&\"20\"&RIGHT(B19,2),-1),1,Feriados!$A$2:$A$937)","v":"2024-07-01"},78317.762509144552,{"$f":"NETWORKDAYS('Curva de Juros Pré'!$B$1,D19,Feriados!$A$2:$A$937)-1","v":485},{"$f":"InterpolaPre(F19)","v":0.13539999999999996},{"$f":"VLOOKUP(B19,'Contratos em Aberto DI'!$A$2:$C$40,2,FALSE)","v":798669},{"$f":"VLOOKUP(B19,'Contratos em Aberto DI'!$A$2:$C$40,3,FALSE)","v":0},-13.27384214628546]
[null,{"$f":"'Contratos em Aberto DI'!A18","v":"V24"},{"$f":"VLOOKUP(MID(B20,1,1),Legendas!$B$8:$D$19,2,FALSE)","v":"Outubro"},{"$f":"WORKDAY(EOMONTH(\"15/\"&VLOOKUP(MID(B20,1,1),Legendas!$B$8:$D$19,3,FALSE)&\"/\"&\"20\"&RIGHT(B20,2),-1),1,Feriados!$A$2:$A$937)","v":"2024-10-01"},75916.633668503477,{"$f":"NETWORKDAYS('Curva de Juros Pré'!$B$1,D20,Feriados!$A$2:$A$937)-1","v":551},{"$f":"InterpolaPre(F20)","v":0.13430000000000009},{"$f":"VLOOKUP(B20,'Contratos em Aberto DI'!$A$2:$C$40,2,FALSE)","v":98695},{"$f":"VLOOKUP(B20,'Contratos em Aberto DI'!$A$2:$C$40,3,FALSE)","v":0},-14.63184425450163]
[null,{"$f":"'Contratos em Aberto DI'!A19","v":"F25"},{"$f":"VLOOKUP(MID(B21,1,1),Legendas!$B$8:$D$19,2,FALSE)","v":"Janeiro"},{"$f":"WORKDAY(EOMONTH(\"15/\"&VLOOKUP(MID(B21,1,1),Legendas!$B$8:$D$19,3,FALSE)&\"/\"&\"20\"&RIGHT(B21,2),-1),1,Feriados!$A$2:$A$937)","v":"2025-01-02"},73779.188441867096,{"$f":"NETWORKDAYS('Curva de Juros Pré'!$B$1,D21,Feriados!$A$2:$A$937)-1","v":615},{"$f":"InterpolaPre(F21)","v":0.13270000000000004},{"$f":"VLOOKUP(B21,'Contratos em Aberto DI'!$A$2:$C$40,2,FALSE)","v":2743818},{"$f":"VLOOKUP(B21,'Contratos em Aberto DI'!$A$2:$C$40,3,FALSE)","v":0},-15.893794566494762]
[null,{"$f":"'Contratos em Aberto DI'!A20","v":"J25"},{"$f":"VLOOKUP(MID(B22,1,1),Legendas!$B$8:$D$19,2,FALSE)","v":"Abril"},{"$f":"WORKDAY(EOMONTH(\"15/\"&VLOOKUP(MID(B22,1,1),Legendas!$B$8:$D$19,3,FALSE)&\"/\"&\"20\"&RIGHT(B22,2),-1),1,Feriados!$A$2:$A$937)","v":"2025-04-01"},71637.963411690725,{"$f":"NETWORKDAYS('Curva de Juros Pré'!$B$1,D22,Feriados!$A$2:$A$937)-1","v":676},{"$f":"InterpolaPre(F22)","v":0.13240000000000007},{"$f":"VLOOKUP(B22,'Contratos em Aberto DI'!$A$2:$C$40,2,FALSE)","v":54361},{"$f":"VLOOKUP(B22,'Contratos em Aberto DI'!$A$2:$C$40,3,FALSE)","v":0},-16.967541242716834]
[null,{"$f":"'Contratos em Aberto DI'!A21","v":"N25"},{"$f":"VLOOKUP(MID(B23,1,1),Legendas!$B$8:$D$19,2,FALSE)","v":"Julho"},{"$f":"WORKDAY(EOMONTH(\"15/\"&VLOOKUP(MID(B23,1,1),Legendas!$B$8:$D$19,3,FALSE)&\"/\"&\"20\"&RIGHT(B23,2),-1),1,Feriados!$A$2:$A$937)","v":"2025-07-01"},69603.772224352026,{"$f":"NETWORKDAYS('Curva de Juros Pré'!$B$1,D23,Feriados!$A$2:$A$937)-1","v":737},{"$f":"InterpolaPre(F23)","v":0.13189999999999991},{"$f":"VLOOKUP(B23,'Contratos em Aberto DI'!$A$2:$C$40,2,FALSE)","v":998238},{"$f":"VLOOKUP(B23,'Contratos em Aberto DI'!$A$2:$C$40,3,FALSE)","v":0},-17.981105032318737]
[null,{"$f":"'Contratos em Aberto DI'!A22","v":"V25"},{"$f":"VLOOKUP(MID(B24,1,1),Legendas!$B$8:$D$19,2,FALSE)","v":"Outubro"},{"$f":"WORKDAY(EOMONTH(\"15/\"&VLOOKUP(MID(B24,1,1),Legendas!$B$8:$D$19,3,FALSE)&\"/\"&\"20\"&RIGHT(B24,2),-1),1,Feriados!$A$2:$A$937)","v":"2025-10-01"},67324.549002286236,{"$f":"NETWORKDAYS('Curva de Juros Pré'!$B$1,D24,Feriados!$A$2:$A$937)-1","v":803},{"$f":"InterpolaPre(F24)","v":0.1322000000000001},{"$f":"VLOOKUP(B24,'Contratos em Aberto DI'!$A$2:$C$40,2,FALSE)","v":42558},{"$f":"VLOOKUP(B24,'Contratos em Aberto DI'!$A$2:$C$40,3,FALSE)","v":0},-18.944581577510689]
[null,{"$f":"'Contratos em Aberto DI'!A23","v":"F26"},{"$f":"VLOOKUP(MID(B25,1,1),Legendas!$B$8:$D$19,2,FALSE)","v":"Janeiro"},{"$f":"WORKDAY(EOMONTH(\"15/\"&VLOOKUP(MID(B25,1,1),Legendas!$B$8:$D$19,3,FALSE)&\"/\"&\"20\"&RIGHT(B25,2),-1),1,Feriados!$A$2:$A$937)","v":"2026-01-02"},65281.975986419398,{"$f":"NETWORKDAYS('Curva de Juros Pré'!$B$1,D25,Feriados!$A$2:$A$937)-1","v":868},{"$f":"InterpolaPre(F25)","v":0.13179999999999992},{"$f":"VLOOKUP(B25,'Contratos em Aberto DI'!$A$2:$C$40,2,FALSE)","v":527100},{"$f":"VLOOKUP(B25,'Contratos em Aberto DI'!$A$2:$C$40,3,FALSE)","v":0},-19.863579840195598]
[null,{"$f":"'Contratos em Aberto DI'!A24","v":"J26"},{"$f":"VLOOKUP(MID(B26,1,1),Legendas!$B$8:$D$19,2,FALSE)","v":"Abril"},{"$f":"WORKDAY(EOMONTH(\"15/\"&VLOOKUP(MID(B26,1,1),Legendas!$B$8:$D$19,3,FALSE)&\"/\"&\"20\"&RIGHT(B26,2),-1),1,Feriados!$A$2:$A$937)","v":"2026-04-01"},63333.889506810279,{"$f":"NETWORKDAYS('Curva de Juros Pré'!$B$1,D26,Feriados!$A$2:$A$937)-1","v":929},{"$f":"InterpolaPre(F26)","v":0.13189999999999991},{"$f":"VLOOKUP(B26,'Contratos em Aberto DI'!$A$2:$C$40,2,FALSE)","v":35645},{"$f":"VLOOKUP(B26,'Contratos em Aberto DI'!$A$2:$C$40,3,FALSE)","v":0},-20.623072648500965]
[null,{"$f":"'Contratos em Aberto DI'!A25","v":"N26"},{"$f":"VLOOKUP(MID(B27,1,1),Legendas!$B$8:$D$19,2,FALSE)","v":"Julho"},{"$f":"WORKDAY(EOMONTH(\"15/\"&VLOOKUP(MID(B27,1,1),Legendas!$B$8:$D$19,3,FALSE)&\"/\"&\"20\"&RIGHT(B27,2),-1),1,Feriados!$A$2:$A$937)","v":"2026-07-01"},61483.974492093992,{"$f":"NETWORKDAYS('Curva de Juros Pré'!$B$1,D27,Feriados!$A$2:$A$937)-1","v":990},{"$f":"InterpolaPre(F27)","v":0.13179999999999992},{"$f":"VLOOKUP(B27,'Contratos em Aberto DI'!$A$2:$C$40,2,FALSE)","v":106995},{"$f":"VLOOKUP(B27,'Contratos em Aberto DI'!$A$2:$C$40,3,FALSE)","v":0},-21.336950246994093]
[null,{"$f":"'Contratos em Aberto DI'!A26","v":"V26"},{"$f":"VLOOKUP(MID(B28,1,1),Legendas!$B$8:$D$19,2,FALSE)","v":"Outubro"},{"$f":"WORKDAY(EOMONTH(\"15/\"&VLOOKUP(MID(B28,1,1),Legendas!$B$8:$D$19,3,FALSE)&\"/\"&\"20\"&RIGHT(B28,2),-1),1,Feriados!$A$2:$A$937)","v":"2026-10-01"},59353.664778065744,{"$f":"NETWORKDAYS('Curva de Juros Pré'!$B$1,D28,Feriados!$A$2:$A$937)-1","v":1055},{"$f":"InterpolaPre(F28)","v":0.13270000000000004},{"$f":"VLOOKUP(B28,'Contratos em Aberto DI'!$A$2:$C$40,2,FALSE)","v":16438},{"$f":"VLOOKUP(B28,'Contratos em Aberto DI'!$A$2:$C$40,3,FALSE)","v":0},-21.932348356873263]
[null,{"$f":"'Contratos em Aberto DI'!A27","v":"F27"},{"$f":"VLOOKUP(MID(B29,1,1),Legendas!$B$8:$D$19,2,FALSE)","v":"Janeiro"},{"$f":"WORKDAY(EOMONTH(\"15/\"&VLOOKUP(MID(B29,1,1),Legendas!$B$8:$D$19,3,FALSE)&\"/\"&\"20\"&RIGHT(B29,2),-1),1,Feriados!$A$2:$A$937)","v":"2027-01-04"},57600.889421807369,{"$f":"NETWORKDAYS('Curva de Juros Pré'!$B$1,D29,Feriados!$A$2:$A$937)-1","v":1118},{"$f":"InterpolaPre(F29)","v":0.13240000000000007},{"$f":"VLOOKUP(B29,'Contratos em Aberto DI'!$A$2:$C$40,2,FALSE)","v":944765},{"$f":"VLOOKUP(B29,'Contratos em Aberto DI'!$A$2:$C$40,3,FALSE)","v":0},-22.561415781528922]
[null,{"$f":"'Contratos em Aberto DI'!A28","v":"J27"},{"$f":"VLOOKUP(MID(B30,1,1),Legendas!$B$8:$D$19,2,FALSE)","v":"Abril"},{"$f":"WORKDAY(EOMONTH(\"15/\"&VLOOKUP(MID(B30,1,1),Legendas!$B$8:$D$19,3,FALSE)&\"/\"&\"20\"&RIGHT(B30,2),-1),1,Feriados!$A$2:$A$937)","v":"2027-04-01"},55966.824896530845,{"$f":"NETWORKDAYS('Curva de Juros Pré'!$B$1,D30,Feriados!$A$2:$A$937)-1","v":1178},{"$f":"InterpolaPre(F30)","v":0.1322000000000001},{"$f":"VLOOKUP(B30,'Contratos em Aberto DI'!$A$2:$C$40,2,FALSE)","v":24243},{"$f":"VLOOKUP(B30,'Contratos em Aberto DI'!$A$2:$C$40,3,FALSE)","v":0},-23.101673500575998]
[null,{"$f":"'Contratos em Aberto DI'!A29","v":"N27"},{"$f":"VLOOKUP(MID(B31,1,1),Legendas!$B$8:$D$19,2,FALSE)","v":"Julho"},{"$f":"WORKDAY(EOMONTH(\"15/\"&VLOOKUP(MID(B31,1,1),Legendas!$B$8:$D$19,3,FALSE)&\"/\"&\"20\"&RIGHT(B31,2),-1),1,Feriados!$A$2:$A$937)","v":"2027-07-01"},54161.965261581405,{"$f":"NETWORKDAYS('Curva de Juros Pré'!$B$1,D31,Feriados!$A$2:$A$937)-1","v":1241},{"$f":"InterpolaPre(F31)","v":0.13260000000000005},{"$f":"VLOOKUP(B31,'Contratos em Aberto DI'!$A$2:$C$40,2,FALSE)","v":6360},{"$f":"VLOOKUP(B31,'Contratos em Aberto DI'!$A$2:$C$40,3,FALSE)","v":0},-23.543743455207732]
[null,{"$f":"'Contratos em Aberto DI'!A30","v":"F28"},{"$f":"VLOOKUP(MID(B32,1,1),Legendas!$B$8:$D$19,2,FALSE)","v":"Janeiro"},{"$f":"WORKDAY(EOMONTH(\"15/\"&VLOOKUP(MID(B32,1,1),Legendas!$B$8:$D$19,3,FALSE)&\"/\"&\"20\"&RIGHT(B32,2),-1),1,Feriados!$A$2:$A$937)","v":"2028-01-03"},50793.761202955247,{"$f":"NETWORKDAYS('Curva de Juros Pré'!$B$1,D32,Feriados!$A$2:$A$937)-1","v":1369},{"$f":"InterpolaPre(F32)","v":0.13280000000000003},{"$f":"VLOOKUP(B32,'Contratos em Aberto DI'!$A$2:$C$40,2,FALSE)","v":62075},{"$f":"VLOOKUP(B32,'Contratos em Aberto DI'!$A$2:$C$40,3,FALSE)","v":0},-24.3521182264667]
[null,{"$f":"'Contratos em Aberto DI'!A31","v":"F29"},{"$f":"VLOOKUP(MID(B33,1,1),Legendas!$B$8:$D$19,2,FALSE)","v":"Janeiro"},{"$f":"WORKDAY(EOMONTH(\"15/\"&VLOOKUP(MID(B33,1,1),Legendas!$B$8:$D$19,3,FALSE)&\"/\"&\"20\"&RIGHT(B33,2),-1),1,Feriados!$A$2:$A$937)","v":"2029-01-02"},44753.321537229684,{"$f":"NETWORKDAYS('Curva de Juros Pré'!$B$1,D33,Feriados!$A$2:$A$937)-1","v":1618},{"$f":"InterpolaPre(F33)","v":0.13339999999999996},{"$f":"VLOOKUP(B33,'Contratos em Aberto DI'!$A$2:$C$40,2,FALSE)","v":475553},{"$f":"VLOOKUP(B33,'Contratos em Aberto DI'!$A$2:$C$40,3,FALSE)","v":0},-25.34415887646901]
[null,{"$f":"'Contratos em Aberto DI'!A32","v":"F30"},{"$f":"VLOOKUP(MID(B34,1,1),Legendas!$B$8:$D$19,2,FALSE)","v":"Janeiro"},{"$f":"WORKDAY(EOMONTH(\"15/\"&VLOOKUP(MID(B34,1,1),Legendas!$B$8:$D$19,3,FALSE)&\"/\"&\"20\"&RIGHT(B34,2),-1),1,Feriados!$A$2:$A$937)","v":"2030-01-02"},39473.501382734976,{"$f":"NETWORKDAYS('Curva de Juros Pré'!$B$1,D34,Feriados!$A$2:$A$937)-1","v":1868},{"$f":"InterpolaPre(F34)","v":0.13359999999999994},{"$f":"VLOOKUP(B34,'Contratos em Aberto DI'!$A$2:$C$40,2,FALSE)","v":48150},{"$f":"VLOOKUP(B34,'Contratos em Aberto DI'!$A$2:$C$40,3,FALSE)","v":0},-25.802453835553024]
[null,{"$f":"'Contratos em Aberto DI'!A33","v":"F31"},{"$f":"VLOOKUP(MID(B35,1,1),Legendas!$B$8:$D$19,2,FALSE)","v":"Janeiro"},{"$f":"WORKDAY(EOMONTH(\"15/\"&VLOOKUP(MID(B35,1,1),Legendas!$B$8:$D$19,3,FALSE)&\"/\"&\"20\"&RIGHT(B35,2),-1),1,Feriados!$A$2:$A$937)","v":"2031-01-02"},34700.850890756723,{"$f":"NETWORKDAYS('Curva de Juros Pré'!$B$1,D35,Feriados!$A$2:$A$937)-1","v":2121},{"$f":"InterpolaPre(F35)","v":0.1339999999999999},{"$f":"VLOOKUP(B35,'Contratos em Aberto DI'!$A$2:$C$40,2,FALSE)","v":302359},{"$f":"VLOOKUP(B35,'Contratos em Aberto DI'!$A$2:$C$40,3,FALSE)","v":0},-25.744644393082126]
[null,{"$f":"'Contratos em Aberto DI'!A34","v":"F32"},{"$f":"VLOOKUP(MID(B36,1,1),Legendas!$B$8:$D$19,2,FALSE)","v":"Janeiro"},{"$f":"WORKDAY(EOMONTH(\"15/\"&VLOOKUP(MID(B36,1,1),Legendas!$B$8:$D$19,3,FALSE)&\"/\"&\"20\"&RIGHT(B36,2),-1),1,Feriados!$A$2:$A$937)","v":"2032-01-02"},30559.734693988416,{"$f":"NETWORKDAYS('Curva de Juros Pré'!$B$1,D36,Feriados!$A$2:$A$937)-1","v":2374},{"$f":"InterpolaPre(F36)","v":0.13410000000000011},{"$f":"VLOOKUP(B36,'Contratos em Aberto DI'!$A$2:$C$40,2,FALSE)","v":13745},{"$f":"VLOOKUP(B36,'Contratos em Aberto DI'!$A$2:$C$40,3,FALSE)","v":0},-25.373413625267858]
[null,{"$f":"'Contratos em Aberto DI'!A35","v":"F33"},{"$f":"VLOOKUP(MID(B37,1,1),Legendas!$B$8:$D$19,2,FALSE)","v":"Janeiro"},{"$f":"WORKDAY(EOMONTH(\"15/\"&VLOOKUP(MID(B37,1,1),Legendas!$B$8:$D$19,3,FALSE)&\"/\"&\"20\"&RIGHT(B37,2),-1),1,Feriados!$A$2:$A$937)","v":"2033-01-03"},26896.774370309111,{"$f":"NETWORKDAYS('Curva de Juros Pré'!$B$1,D37,Feriados!$A$2:$A$937)-1","v":2626},{"$f":"InterpolaPre(F37)","v":0.13430000000000009},{"$f":"VLOOKUP(B37,'Contratos em Aberto DI'!$A$2:$C$40,2,FALSE)","v":102147},{"$f":"VLOOKUP(B37,'Contratos em Aberto DI'!$A$2:$C$40,3,FALSE)","v":0},-24.69720689794849]
[null,{"$f":"'Contratos em Aberto DI'!A36","v":"F34"},{"$f":"VLOOKUP(MID(B38,1,1),Legendas!$B$8:$D$19,2,FALSE)","v":"Janeiro"},{"$f":"WORKDAY(EOMONTH(\"15/\"&VLOOKUP(MID(B38,1,1),Legendas!$B$8:$D$19,3,FALSE)&\"/\"&\"20\"&RIGHT(B38,2),-1),1,Feriados!$A$2:$A$937)","v":"2034-01-02"},23676.379316909908,{"$f":"NETWORKDAYS('Curva de Juros Pré'!$B$1,D38,Feriados!$A$2:$A$937)-1","v":2877},{"$f":"InterpolaPre(F38)","v":0.13450000000000006},{"$f":"VLOOKUP(B38,'Contratos em Aberto DI'!$A$2:$C$40,2,FALSE)","v":1100},{"$f":"VLOOKUP(B38,'Contratos em Aberto DI'!$A$2:$C$40,3,FALSE)","v":0},-23.812910482709412]
[null,{"$f":"'Contratos em Aberto DI'!A37","v":"F35"},{"$f":"VLOOKUP(MID(B39,1,1),Legendas!$B$8:$D$19,2,FALSE)","v":"Janeiro"},{"$f":"WORKDAY(EOMONTH(\"15/\"&VLOOKUP(MID(B39,1,1),Legendas!$B$8:$D$19,3,FALSE)&\"/\"&\"20\"&RIGHT(B39,2),-1),1,Feriados!$A$2:$A$937)","v":"2035-01-02"},20900.815108855582,{"$f":"NETWORKDAYS('Curva de Juros Pré'!$B$1,D39,Feriados!$A$2:$A$937)-1","v":3126},{"$f":"InterpolaPre(F39)","v":0.13450000000000006},{"$f":"VLOOKUP(B39,'Contratos em Aberto DI'!$A$2:$C$40,2,FALSE)","v":2970},{"$f":"VLOOKUP(B39,'Contratos em Aberto DI'!$A$2:$C$40,3,FALSE)","v":0},-22.83971167436539]
[null,{"$f":"'Contratos em Aberto DI'!A38","v":"F36"},{"$f":"VLOOKUP(MID(B40,1,1),Legendas!$B$8:$D$19,2,FALSE)","v":"Janeiro"},{"$f":"WORKDAY(EOMONTH(\"15/\"&VLOOKUP(MID(B40,1,1),Legendas!$B$8:$D$19,3,FALSE)&\"/\"&\"20\"&RIGHT(B40,2),-1),1,Feriados!$A$2:$A$937)","v":"2036-01-02"},18397.893071453065,{"$f":"NETWORKDAYS('Curva de Juros Pré'!$B$1,D40,Feriados!$A$2:$A$937)-1","v":3376},{"$f":"InterpolaPre(F40)","v":0.13470000000000004},{"$f":"VLOOKUP(B40,'Contratos em Aberto DI'!$A$2:$C$40,2,FALSE)","v":20455},{"$f":"VLOOKUP(B40,'Contratos em Aberto DI'!$A$2:$C$40,3,FALSE)","v":0},-21.707682368862152]
[null,{"$f":"'Contratos em Aberto DI'!A39","v":"F37"},{"$f":"VLOOKUP(MID(B41,1,1),Legendas!$B$8:$D$19,2,FALSE)","v":"Janeiro"},{"$f":"WORKDAY(EOMONTH(\"15/\"&VLOOKUP(MID(B41,1,1),Legendas!$B$8:$D$19,3,FALSE)&\"/\"&\"20\"&RIGHT(B41,2),-1),1,Feriados!$A$2:$A$937)","v":"2037-01-02"},16197.629902997245,{"$f":"NETWORKDAYS('Curva de Juros Pré'!$B$1,D41,Feriados!$A$2:$A$937)-1","v":3630},{"$f":"InterpolaPre(F41)","v":0.13470000000000004},{"$f":"VLOOKUP(B41,'Contratos em Aberto DI'!$A$2:$C$40,2,FALSE)","v":800},{"$f":"VLOOKUP(B41,'Contratos em Aberto DI'!$A$2:$C$40,3,FALSE)","v":0},-20.5485765443118]

{"sheet":"Contratos em Aberto DI","index":1,"n_rows":39,"n_cols":7,"rows_kept":39,"cut":false,"hidden":false,"merged":[[0,0,0,2]]}
[]
["Q22",742547,0,null,null,"Site:","https://www.b3.com.br/pt_br/market-data-e-indices/servicos-de-dados/market-data/consultas/mercado-de-derivativos/contratos-em-aberto/vencimento-serie/contratos-em-aberto-futuro/"]
["U22",518765,0]
["V22",2231457,0]
["X22",325915,0]
["Z22",264213,0]
["F23",5413628,0]
["G23",74540,0]
["H23",75897,0]
["J23",630865,0]
["K23",29478,0]
["M23",30150,0]
["N23",2172565,0]
["V23",309489,0]
["F24",3745488,0]
["J24",809212,0]
["N24",798669,0]
["V24",98695,0]
["F25",2743818,0]
["J25",54361,0]
["N25",998238,0]
["V25",42558,0]
["F26",527100,0]
["J26",35645,0]
["N26",106995,0]
["V26",16438,0]
["F27",944765,0]
["J27",24243,0]
["N27",6360,0]
["F28",62075,0]
["F29",475553,0]
["F30",48150,0]
["F31",302359,0]
["F32",13745,0]
["F33",102147,0]
["F34",1100,0]
["F35",2970,0]
["F36",20455,0]
["F37",800,0]

{"sheet":"Curva de Juros Pré","index":2,"n_rows":268,"n_cols":3,"rows_kept":268,"cut":false,"hidden":false,"merged":[]}
["Data",{"$f":"'Anbima LTN'!K1","v":"2022-07-22"},"https://www.b3.com.br/pt_br/market-data-e-indices/servicos-de-dados/market-data/consultas/mercado-de-derivativos/precos-referenciais/taxas-referenciais-bm-fbovespa/"]
[]
["DC","DU","ETTJ Pré"]
[3,{"$f":"NETWORKDAYS($B$1,$B$1+A4,Feriados!$A$2:$A$937)-1","v":1},0.13150000000000001]
[6,{"$f":"NETWORKDAYS($B$1,$B$1+A5,Feriados!$A$2:$A$937)-1","v":4},0.13150000000000001]
[7,{"$f":"NETWORKDAYS($B$1,$B$1+A6,Feriados!$A$2:$A$937)-1","v":5},0.13150000000000001]
[10,{"$f":"NETWORKDAYS($B$1,$B$1+A7,Feriados!$A$2:$A$937)-1","v":6},0.13150000000000001]
[14,{"$f":"NETWORKDAYS($B$1,$B$1+A8,Feriados!$A$2:$A$937)-1","v":10},0.13320000000000001]
[21,{"$f":"NETWORKDAYS($B$1,$B$1+A9,Feriados!$A$2:$A$937)-1","v":15},0.13400000000000001]
[24,{"$f":"NETWORKDAYS($B$1,$B$1+A10,Feriados!$A$2:$A$937)-1","v":16},0.1341]
[26,{"$f":"NETWORKDAYS($B$1,$B$1+A11,Feriados!$A$2:$A$937)-1","v":18},0.1343]
[28,{"$f":"NETWORKDAYS($B$1,$B$1+A12,Feriados!$A$2:$A$937)-1","v":20},0.13439999999999999]
[31,{"$f":"NETWORKDAYS($B$1,$B$1+A13,Feriados!$A$2:$A$937)-1","v":21},0.13449999999999998]
[33,{"$f":"NETWORKDAYS($B$1,$B$1+A14,Feriados!$A$2:$A$937)-1","v":23},0.1346]
[39,{"$f":"NETWORKDAYS($B$1,$B$1+A15,Feriados!$A$2:$A$937)-1","v":27},0.13470000000000001]
[40,{"$f":"NETWORKDAYS($B$1,$B$1+A16,Feriados!$A$2:$A$937)-1","v":28},0.1348]
[41,{"$f":"NETWORKDAYS($B$1,$B$1+A17,Feriados!$A$2:$A$937)-1","v":29},0.1348]
[49,{"$f":"NETWORKDAYS($B$1,$B$1+A18,Feriados!$A$2:$A$937)-1","v":34},0.13519999999999999]
[54,{"$f":"NETWORKDAYS($B$1,$B$1+A19,Feriados!$A$2:$A$937)-1","v":37},0.13539999999999999]
[55,{"$f":"NETWORKDAYS($B$1,$B$1+A20,Feriados!$A$2:$A$937)-1","v":38},0.13539999999999999]
[56,{"$f":"NETWORKDAYS($B$1,$B$1+A21,Feriados!$A$2:$A$937)-1","v":39},0.13550000000000001]
[60,{"$f":"NETWORKDAYS($B$1,$B$1+A22,Feriados!$A$2:$A$937)-1","v":41},0.1356]
[62,{"$f":"NETWORKDAYS($B$1,$B$1+A23,Feriados!$A$2:$A$937)-1","v":43},0.13570000000000002]
[70,{"$f":"NETWORKDAYS($B$1,$B$1+A24,Feriados!$A$2:$A$937)-1","v":49},0.13589999999999999]
[73,{"$f":"NETWORKDAYS($B$1,$B$1+A25,Feriados!$A$2:$A$937)-1","v":50},0.13589999999999999]
[83,{"$f":"NETWORKDAYS($B$1,$B$1+A26,Feriados!$A$2:$A$937)-1","v":57},0.13639999999999999]
[87,{"$f":"NETWORKDAYS($B$1,$B$1+A27,Feriados!$A$2:$A$937)-1","v":59},0.1366]
[90,{"$f":"NETWORKDAYS($B$1,$B$1+A28,Feriados!$A$2:$A$937)-1","v":62},0.13669999999999999]
[98,{"$f":"NETWORKDAYS($B$1,$B$1+A29,Feriados!$A$2:$A$937)-1","v":68},0.13699999999999998]
[101,{"$f":"NETWORKDAYS($B$1,$B$1+A30,Feriados!$A$2:$A$937)-1","v":69},0.1371]
[102,{"$f":"NETWORKDAYS($B$1,$B$1+A31,Feriados!$A$2:$A$937)-1","v":70},0.1371]
[117,{"$f":"NETWORKDAYS($B$1,$B$1+A32,Feriados!$A$2:$A$937)-1","v":79},0.1376]
[122,{"$f":"NETWORKDAYS($B$1,$B$1+A33,Feriados!$A$2:$A$937)-1","v":82},0.13769999999999999]
[131,{"$f":"NETWORKDAYS($B$1,$B$1+A34,Feriados!$A$2:$A$937)-1","v":89},0.13800000000000001]
[132,{"$f":"NETWORKDAYS($B$1,$B$1+A35,Feriados!$A$2:$A$937)-1","v":90},0.13800000000000001]
[140,{"$f":"NETWORKDAYS($B$1,$B$1+A36,Feriados!$A$2:$A$937)-1","v":96},0.13819999999999999]
[145,{"$f":"NETWORKDAYS($B$1,$B$1+A37,Feriados!$A$2:$A$937)-1","v":99},0.13830000000000001]
[146,{"$f":"NETWORKDAYS($B$1,$B$1+A38,Feriados!$A$2:$A$937)-1","v":100},0.13830000000000001]
[147,{"$f":"NETWORKDAYS($B$1,$B$1+A39,Feriados!$A$2:$A$937)-1","v":101},0.13830000000000001]
[150,{"$f":"NETWORKDAYS($B$1,$B$1+A40,Feriados!$A$2:$A$937)-1","v":102},0.1384]
[152,{"$f":"NETWORKDAYS($B$1,$B$1+A41,Feriados!$A$2:$A$937)-1","v":104},0.1384]
[159,{"$f":"NETWORKDAYS($B$1,$B$1+A42,Feriados!$A$2:$A$937)-1","v":109},0.13849999999999998]
[160,{"$f":"NETWORKDAYS($B$1,$B$1+A43,Feriados!$A$2:$A$937)-1","v":110},0.1386]
[164,{"$f":"NETWORKDAYS($B$1,$B$1+A44,Feriados!$A$2:$A$937)-1","v":112},0.1386]
[178,{"$f":"NETWORKDAYS($B$1,$B$1+A45,Feriados!$A$2:$A$937)-1","v":122},0.13880000000000001]
[180,{"$f":"NETWORKDAYS($B$1,$B$1+A46,Feriados!$A$2:$A$937)-1","v":124},0.1389]
[194,{"$f":"NETWORKDAYS($B$1,$B$1+A47,Feriados!$A$2:$A$937)-1","v":134},0.13900000000000001]
[208,{"$f":"NETWORKDAYS($B$1,$B$1+A48,Feriados!$A$2:$A$937)-1","v":144},0.1391]
[209,{"$f":"NETWORKDAYS($B$1,$B$1+A49,Feriados!$A$2:$A$937)-1","v":145},0.1391]
[210,{"$f":"NETWORKDAYS($B$1,$B$1+A50,Feriados!$A$2:$A$937)-1","v":146},0.1391]
[220,{"$f":"NETWORKDAYS($B$1,$B$1+A51,Feriados!$A$2:$A$937)-1","v":150},0.1391]
[221,{"$f":"NETWORKDAYS($B$1,$B$1+A52,Feriados!$A$2:$A$937)-1","v":151},0.1391]
[222,{"$f":"NETWORKDAYS($B$1,$B$1+A53,Feriados!$A$2:$A$937)-1","v":152},0.1391]
[236,{"$f":"NETWORKDAYS($B$1,$B$1+A54,Feriados!$A$2:$A$937)-1","v":162},0.1394]
[238,{"$f":"NETWORKDAYS($B$1,$B$1+A55,Feriados!$A$2:$A$937)-1","v":164},0.13949999999999999]
[241,{"$f":"NETWORKDAYS($B$1,$B$1+A56,Feriados!$A$2:$A$937)-1","v":165},0.13949999999999999]
[244,{"$f":"NETWORKDAYS($B$1,$B$1+A57,Feriados!$A$2:$A$937)-1","v":168},0.1396]
[252,{"$f":"NETWORKDAYS($B$1,$B$1+A58,Feriados!$A$2:$A$937)-1","v":174},0.13980000000000001]
[255,{"$f":"NETWORKDAYS($B$1,$B$1+A59,Feriados!$A$2:$A$937)-1","v":175},0.13980000000000001]
[264,{"$f":"NETWORKDAYS($B$1,$B$1+A60,Feriados!$A$2:$A$937)-1","v":181},0.13980000000000001]
[269,{"$f":"NETWORKDAYS($B$1,$B$1+A61,Feriados!$A$2:$A$937)-1","v":184},0.1399]
[270,{"$f":"NETWORKDAYS($B$1,$B$1+A62,Feriados!$A$2:$A$937)-1","v":185},0.1399]
[279,{"$f":"NETWORKDAYS($B$1,$B$1+A63,Feriados!$A$2:$A$937)-1","v":191},0.1399]
[280,{"$f":"NETWORKDAYS($B$1,$B$1+A64,Feriados!$A$2:$A$937)-1","v":192},0.1399]
[284,{"$f":"NETWORKDAYS($B$1,$B$1+A65,Feriados!$A$2:$A$937)-1","v":193},0.1399]
[297,{"$f":"NETWORKDAYS($B$1,$B$1+A66,Feriados!$A$2:$A$937)-1","v":202},0.14000000000000001]
[300,{"$f":"NETWORKDAYS($B$1,$B$1+A67,Feriados!$A$2:$A$937)-1","v":205},0.14000000000000001]
[313,{"$f":"NETWORKDAYS($B$1,$B$1+A68,Feriados!$A$2:$A$937)-1","v":214},0.14000000000000001]
[314,{"$f":"NETWORKDAYS($B$1,$B$1+A69,Feriados!$A$2:$A$937)-1","v":215},0.14000000000000001]
[327,{"$f":"NETWORKDAYS($B$1,$B$1+A70,Feriados!$A$2:$A$937)-1","v":223},0.1401]
[328,{"$f":"NETWORKDAYS($B$1,$B$1+A71,Feriados!$A$2:$A$937)-1","v":224},0.1401]
[329,{"$f":"NETWORKDAYS($B$1,$B$1+A72,Feriados!$A$2:$A$937)-1","v":225},0.1401]
[332,{"$f":"NETWORKDAYS($B$1,$B$1+A73,Feriados!$A$2:$A$937)-1","v":226},0.1401]
[335,{"$f":"NETWORKDAYS($B$1,$B$1+A74,Feriados!$A$2:$A$937)-1","v":229},0.1401]
[342,{"$f":"NETWORKDAYS($B$1,$B$1+A75,Feriados!$A$2:$A$937)-1","v":234},0.14019999999999999]
[343,{"$f":"NETWORKDAYS($B$1,$B$1+A76,Feriados!$A$2:$A$937)-1","v":235},0.14019999999999999]
[346,{"$f":"NETWORKDAYS($B$1,$B$1+A77,Feriados!$A$2:$A$937)-1","v":236},0.14019999999999999]
[355,{"$f":"NETWORKDAYS($B$1,$B$1+A78,Feriados!$A$2:$A$937)-1","v":243},0.1401]
[360,{"$f":"NETWORKDAYS($B$1,$B$1+A79,Feriados!$A$2:$A$937)-1","v":246},0.14000000000000001]
[371,{"$f":"NETWORKDAYS($B$1,$B$1+A80,Feriados!$A$2:$A$937)-1","v":255},0.1399]
[374,{"$f":"NETWORKDAYS($B$1,$B$1+A81,Feriados!$A$2:$A$937)-1","v":256},0.1399]
[389,{"$f":"NETWORKDAYS($B$1,$B$1+A82,Feriados!$A$2:$A$937)-1","v":267},0.13970000000000002]
[390,{"$f":"NETWORKDAYS($B$1,$B$1+A83,Feriados!$A$2:$A$937)-1","v":268},0.13970000000000002]
[406,{"$f":"NETWORKDAYS($B$1,$B$1+A84,Feriados!$A$2:$A$937)-1","v":280},0.1396]
[420,{"$f":"NETWORKDAYS($B$1,$B$1+A85,Feriados!$A$2:$A$937)-1","v":289},0.13949999999999999]
[426,{"$f":"NETWORKDAYS($B$1,$B$1+A86,Feriados!$A$2:$A$937)-1","v":293},0.1394]
[437,{"$f":"NETWORKDAYS($B$1,$B$1+A87,Feriados!$A$2:$A$937)-1","v":300},0.1394]
[451,{"$f":"NETWORKDAYS($B$1,$B$1+A88,Feriados!$A$2:$A$937)-1","v":309},0.1391]
[453,{"$f":"NETWORKDAYS($B$1,$B$1+A89,Feriados!$A$2:$A$937)-1","v":311},0.1391]
[466,{"$f":"NETWORKDAYS($B$1,$B$1+A90,Feriados!$A$2:$A$937)-1","v":320},0.1389]
[480,{"$f":"NETWORKDAYS($B$1,$B$1+A91,Feriados!$A$2:$A$937)-1","v":329},0.13869999999999999]
[482,{"$f":"NETWORKDAYS($B$1,$B$1+A92,Feriados!$A$2:$A$937)-1","v":330},0.13869999999999999]
[509,{"$f":"NETWORKDAYS($B$1,$B$1+A93,Feriados!$A$2:$A$937)-1","v":349},0.13830000000000001]
[510,{"$f":"NETWORKDAYS($B$1,$B$1+A94,Feriados!$A$2:$A$937)-1","v":350},0.13830000000000001]
[515,{"$f":"NETWORKDAYS($B$1,$B$1+A95,Feriados!$A$2:$A$937)-1","v":353},0.13819999999999999]
[529,{"$f":"NETWORKDAYS($B$1,$B$1+A96,Feriados!$A$2:$A$937)-1","v":361},0.1381]
[542,{"$f":"NETWORKDAYS($B$1,$B$1+A97,Feriados!$A$2:$A$937)-1","v":370},0.13789999999999999]
[572,{"$f":"NETWORKDAYS($B$1,$B$1+A98,Feriados!$A$2:$A$937)-1","v":390},0.13750000000000001]
[573,{"$f":"NETWORKDAYS($B$1,$B$1+A99,Feriados!$A$2:$A$937)-1","v":391},0.13750000000000001]
[600,{"$f":"NETWORKDAYS($B$1,$B$1+A100,Feriados!$A$2:$A$937)-1","v":410},0.13720000000000002]
[619,{"$f":"NETWORKDAYS($B$1,$B$1+A101,Feriados!$A$2:$A$937)-1","v":422},0.13699999999999998]
[630,{"$f":"NETWORKDAYS($B$1,$B$1+A102,Feriados!$A$2:$A$937)-1","v":431},0.13669999999999999]
[633,{"$f":"NETWORKDAYS($B$1,$B$1+A103,Feriados!$A$2:$A$937)-1","v":432},0.13669999999999999]
[635,{"$f":"NETWORKDAYS($B$1,$B$1+A104,Feriados!$A$2:$A$937)-1","v":434},0.1366]
[647,{"$f":"NETWORKDAYS($B$1,$B$1+A105,Feriados!$A$2:$A$937)-1","v":442},0.13639999999999999]
[661,{"$f":"NETWORKDAYS($B$1,$B$1+A106,Feriados!$A$2:$A$937)-1","v":451},0.13619999999999999]
[663,{"$f":"NETWORKDAYS($B$1,$B$1+A107,Feriados!$A$2:$A$937)-1","v":453},0.1361]
[690,{"$f":"NETWORKDAYS($B$1,$B$1+A108,Feriados!$A$2:$A$937)-1","v":471},0.13570000000000002]
[691,{"$f":"NETWORKDAYS($B$1,$B$1+A109,Feriados!$A$2:$A$937)-1","v":472},0.13570000000000002]
[710,{"$f":"NETWORKDAYS($B$1,$B$1+A110,Feriados!$A$2:$A$937)-1","v":485},0.13539999999999999]
[720,{"$f":"NETWORKDAYS($B$1,$B$1+A111,Feriados!$A$2:$A$937)-1","v":493},0.1353]
[752,{"$f":"NETWORKDAYS($B$1,$B$1+A112,Feriados!$A$2:$A$937)-1","v":515},0.13489999999999999]
[754,{"$f":"NETWORKDAYS($B$1,$B$1+A113,Feriados!$A$2:$A$937)-1","v":517},0.1348]
[755,{"$f":"NETWORKDAYS($B$1,$B$1+A114,Feriados!$A$2:$A$937)-1","v":518},0.1348]
[780,{"$f":"NETWORKDAYS($B$1,$B$1+A115,Feriados!$A$2:$A$937)-1","v":535},0.13449999999999998]
[802,{"$f":"NETWORKDAYS($B$1,$B$1+A116,Feriados!$A$2:$A$937)-1","v":551},0.1343]
[810,{"$f":"NETWORKDAYS($B$1,$B$1+A117,Feriados!$A$2:$A$937)-1","v":557},0.1341]
[811,{"$f":"NETWORKDAYS($B$1,$B$1+A118,Feriados!$A$2:$A$937)-1","v":558},0.1341]
[840,{"$f":"NETWORKDAYS($B$1,$B$1+A119,Feriados!$A$2:$A$937)-1","v":579},0.13350000000000001]
[850,{"$f":"NETWORKDAYS($B$1,$B$1+A120,Feriados!$A$2:$A$937)-1","v":584},0.13339999999999999]
[871,{"$f":"NETWORKDAYS($B$1,$B$1+A121,Feriados!$A$2:$A$937)-1","v":599},0.13300000000000001]
[895,{"$f":"NETWORKDAYS($B$1,$B$1+A122,Feriados!$A$2:$A$937)-1","v":615},0.13269999999999998]
[900,{"$f":"NETWORKDAYS($B$1,$B$1+A123,Feriados!$A$2:$A$937)-1","v":618},0.1326]
[930,{"$f":"NETWORKDAYS($B$1,$B$1+A124,Feriados!$A$2:$A$937)-1","v":640},0.13250000000000001]
[941,{"$f":"NETWORKDAYS($B$1,$B$1+A125,Feriados!$A$2:$A$937)-1","v":647},0.13250000000000001]
[962,{"$f":"NETWORKDAYS($B$1,$B$1+A126,Feriados!$A$2:$A$937)-1","v":660},0.13250000000000001]
[984,{"$f":"NETWORKDAYS($B$1,$B$1+A127,Feriados!$A$2:$A$937)-1","v":676},0.13239999999999999]
[990,{"$f":"NETWORKDAYS($B$1,$B$1+A128,Feriados!$A$2:$A$937)-1","v":680},0.13239999999999999]
[1015,{"$f":"NETWORKDAYS($B$1,$B$1+A129,Feriados!$A$2:$A$937)-1","v":696},0.13220000000000001]
[1020,{"$f":"NETWORKDAYS($B$1,$B$1+A130,Feriados!$A$2:$A$937)-1","v":699},0.13220000000000001]
[1028,{"$f":"NETWORKDAYS($B$1,$B$1+A131,Feriados!$A$2:$A$937)-1","v":705},0.13220000000000001]
[1050,{"$f":"NETWORKDAYS($B$1,$B$1+A132,Feriados!$A$2:$A$937)-1","v":721},0.13200000000000001]
[1075,{"$f":"NETWORKDAYS($B$1,$B$1+A133,Feriados!$A$2:$A$937)-1","v":737},0.13189999999999999]
[1081,{"$f":"NETWORKDAYS($B$1,$B$1+A134,Feriados!$A$2:$A$937)-1","v":741},0.13189999999999999]
[1110,{"$f":"NETWORKDAYS($B$1,$B$1+A135,Feriados!$A$2:$A$937)-1","v":762},0.13200000000000001]
[1120,{"$f":"NETWORKDAYS($B$1,$B$1+A136,Feriados!$A$2:$A$937)-1","v":770},0.1321]
[1140,{"$f":"NETWORKDAYS($B$1,$B$1+A137,Feriados!$A$2:$A$937)-1","v":784},0.1321]
[1167,{"$f":"NETWORKDAYS($B$1,$B$1+A138,Feriados!$A$2:$A$937)-1","v":803},0.13220000000000001]
[1172,{"$f":"NETWORKDAYS($B$1,$B$1+A139,Feriados!$A$2:$A$937)-1","v":806},0.13220000000000001]
[1200,{"$f":"NETWORKDAYS($B$1,$B$1+A140,Feriados!$A$2:$A$937)-1","v":826},0.13200000000000001]
[1214,{"$f":"NETWORKDAYS($B$1,$B$1+A141,Feriados!$A$2:$A$937)-1","v":836},0.13200000000000001]
[1260,{"$f":"NETWORKDAYS($B$1,$B$1+A142,Feriados!$A$2:$A$937)-1","v":868},0.1318]
[1307,{"$f":"NETWORKDAYS($B$1,$B$1+A143,Feriados!$A$2:$A$937)-1","v":899},0.1318]
[1349,{"$f":"NETWORKDAYS($B$1,$B$1+A144,Feriados!$A$2:$A$937)-1","v":929},0.13189999999999999]
[1393,{"$f":"NETWORKDAYS($B$1,$B$1+A145,Feriados!$A$2:$A$937)-1","v":958},0.1318]
[1440,{"$f":"NETWORKDAYS($B$1,$B$1+A146,Feriados!$A$2:$A$937)-1","v":990},0.1318]
[1487,{"$f":"NETWORKDAYS($B$1,$B$1+A147,Feriados!$A$2:$A$937)-1","v":1023},0.1323]
[1532,{"$f":"NETWORKDAYS($B$1,$B$1+A148,Feriados!$A$2:$A$937)-1","v":1055},0.13269999999999998]
[1578,{"$f":"NETWORKDAYS($B$1,$B$1+A149,Feriados!$A$2:$A$937)-1","v":1085},0.1326]
[1627,{"$f":"NETWORKDAYS($B$1,$B$1+A150,Feriados!$A$2:$A$937)-1","v":1118},0.13239999999999999]
[1669,{"$f":"NETWORKDAYS($B$1,$B$1+A151,Feriados!$A$2:$A$937)-1","v":1146},0.1323]
[1714,{"$f":"NETWORKDAYS($B$1,$B$1+A152,Feriados!$A$2:$A$937)-1","v":1178},0.13220000000000001]
[1760,{"$f":"NETWORKDAYS($B$1,$B$1+A153,Feriados!$A$2:$A$937)-1","v":1209},0.13239999999999999]
[1802,{"$f":"NETWORKDAYS($B$1,$B$1+A154,Feriados!$A$2:$A$937)-1","v":1238},0.1326]
[1805,{"$f":"NETWORKDAYS($B$1,$B$1+A155,Feriados!$A$2:$A$937)-1","v":1241},0.1326]
[1851,{"$f":"NETWORKDAYS($B$1,$B$1+A156,Feriados!$A$2:$A$937)-1","v":1273},0.13269999999999998]
[1943,{"$f":"NETWORKDAYS($B$1,$B$1+A157,Feriados!$A$2:$A$937)-1","v":1335},0.1328]
[1991,{"$f":"NETWORKDAYS($B$1,$B$1+A158,Feriados!$A$2:$A$937)-1","v":1369},0.1328]
[2034,{"$f":"NETWORKDAYS($B$1,$B$1+A159,Feriados!$A$2:$A$937)-1","v":1400},0.13289999999999999]
[2124,{"$f":"NETWORKDAYS($B$1,$B$1+A160,Feriados!$A$2:$A$937)-1","v":1459},0.1331]
[2160,{"$f":"NETWORKDAYS($B$1,$B$1+A161,Feriados!$A$2:$A$937)-1","v":1484},0.1331]
[2173,{"$f":"NETWORKDAYS($B$1,$B$1+A162,Feriados!$A$2:$A$937)-1","v":1493},0.1331]
[2216,{"$f":"NETWORKDAYS($B$1,$B$1+A163,Feriados!$A$2:$A$937)-1","v":1524},0.13320000000000001]
[2309,{"$f":"NETWORKDAYS($B$1,$B$1+A164,Feriados!$A$2:$A$937)-1","v":1587},0.1333]
[2356,{"$f":"NETWORKDAYS($B$1,$B$1+A165,Feriados!$A$2:$A$937)-1","v":1618},0.13339999999999999]
[2400,{"$f":"NETWORKDAYS($B$1,$B$1+A166,Feriados!$A$2:$A$937)-1","v":1648},0.13339999999999999]
[2489,{"$f":"NETWORKDAYS($B$1,$B$1+A167,Feriados!$A$2:$A$937)-1","v":1709},0.13350000000000001]
[2520,{"$f":"NETWORKDAYS($B$1,$B$1+A168,Feriados!$A$2:$A$937)-1","v":1731},0.13350000000000001]
[2537,{"$f":"NETWORKDAYS($B$1,$B$1+A169,Feriados!$A$2:$A$937)-1","v":1742},0.13350000000000001]
[2567,{"$f":"NETWORKDAYS($B$1,$B$1+A170,Feriados!$A$2:$A$937)-1","v":1764},0.13350000000000001]
[2581,{"$f":"NETWORKDAYS($B$1,$B$1+A171,Feriados!$A$2:$A$937)-1","v":1774},0.13350000000000001]
[2674,{"$f":"NETWORKDAYS($B$1,$B$1+A172,Feriados!$A$2:$A$937)-1","v":1837},0.13350000000000001]
[2721,{"$f":"NETWORKDAYS($B$1,$B$1+A173,Feriados!$A$2:$A$937)-1","v":1868},0.1336]
[2765,{"$f":"NETWORKDAYS($B$1,$B$1+A174,Feriados!$A$2:$A$937)-1","v":1900},0.1336]
[2810,{"$f":"NETWORKDAYS($B$1,$B$1+A175,Feriados!$A$2:$A$937)-1","v":1929},0.13369999999999999]
[2854,{"$f":"NETWORKDAYS($B$1,$B$1+A176,Feriados!$A$2:$A$937)-1","v":1959},0.13369999999999999]
[2880,{"$f":"NETWORKDAYS($B$1,$B$1+A177,Feriados!$A$2:$A$937)-1","v":1977},0.1338]
[2901,{"$f":"NETWORKDAYS($B$1,$B$1+A178,Feriados!$A$2:$A$937)-1","v":1991},0.1338]
[2946,{"$f":"NETWORKDAYS($B$1,$B$1+A179,Feriados!$A$2:$A$937)-1","v":2024},0.1338]
[3041,{"$f":"NETWORKDAYS($B$1,$B$1+A180,Feriados!$A$2:$A$937)-1","v":2090},0.13400000000000001]
[3086,{"$f":"NETWORKDAYS($B$1,$B$1+A181,Feriados!$A$2:$A$937)-1","v":2121},0.13400000000000001]
[3132,{"$f":"NETWORKDAYS($B$1,$B$1+A182,Feriados!$A$2:$A$937)-1","v":2153},0.13400000000000001]
[3219,{"$f":"NETWORKDAYS($B$1,$B$1+A183,Feriados!$A$2:$A$937)-1","v":2211},0.13400000000000001]
[3240,{"$f":"NETWORKDAYS($B$1,$B$1+A184,Feriados!$A$2:$A$937)-1","v":2226},0.13400000000000001]
[3311,{"$f":"NETWORKDAYS($B$1,$B$1+A185,Feriados!$A$2:$A$937)-1","v":2276},0.1341]
[3405,{"$f":"NETWORKDAYS($B$1,$B$1+A186,Feriados!$A$2:$A$937)-1","v":2342},0.1341]
[3451,{"$f":"NETWORKDAYS($B$1,$B$1+A187,Feriados!$A$2:$A$937)-1","v":2374},0.1341]
[3496,{"$f":"NETWORKDAYS($B$1,$B$1+A188,Feriados!$A$2:$A$937)-1","v":2403},0.1341]
[3587,{"$f":"NETWORKDAYS($B$1,$B$1+A189,Feriados!$A$2:$A$937)-1","v":2466},0.13419999999999999]
[3601,{"$f":"NETWORKDAYS($B$1,$B$1+A190,Feriados!$A$2:$A$937)-1","v":2475},0.13419999999999999]
[3678,{"$f":"NETWORKDAYS($B$1,$B$1+A191,Feriados!$A$2:$A$937)-1","v":2530},0.13419999999999999]
[3770,{"$f":"NETWORKDAYS($B$1,$B$1+A192,Feriados!$A$2:$A$937)-1","v":2592},0.1343]
[3818,{"$f":"NETWORKDAYS($B$1,$B$1+A193,Feriados!$A$2:$A$937)-1","v":2626},0.1343]
[3861,{"$f":"NETWORKDAYS($B$1,$B$1+A194,Feriados!$A$2:$A$937)-1","v":2657},0.1343]
[3951,{"$f":"NETWORKDAYS($B$1,$B$1+A195,Feriados!$A$2:$A$937)-1","v":2717},0.13439999999999999]
[3960,{"$f":"NETWORKDAYS($B$1,$B$1+A196,Feriados!$A$2:$A$937)-1","v":2724},0.13439999999999999]
[4042,{"$f":"NETWORKDAYS($B$1,$B$1+A197,Feriados!$A$2:$A$937)-1","v":2781},0.13449999999999998]
[4135,{"$f":"NETWORKDAYS($B$1,$B$1+A198,Feriados!$A$2:$A$937)-1","v":2844},0.13449999999999998]
[4182,{"$f":"NETWORKDAYS($B$1,$B$1+A199,Feriados!$A$2:$A$937)-1","v":2877},0.13449999999999998]
[4226,{"$f":"NETWORKDAYS($B$1,$B$1+A200,Feriados!$A$2:$A$937)-1","v":2909},0.13449999999999998]
[4315,{"$f":"NETWORKDAYS($B$1,$B$1+A201,Feriados!$A$2:$A$937)-1","v":2967},0.13449999999999998]
[4322,{"$f":"NETWORKDAYS($B$1,$B$1+A202,Feriados!$A$2:$A$937)-1","v":2972},0.13449999999999998]
[4407,{"$f":"NETWORKDAYS($B$1,$B$1+A203,Feriados!$A$2:$A$937)-1","v":3032},0.13449999999999998]
[4500,{"$f":"NETWORKDAYS($B$1,$B$1+A204,Feriados!$A$2:$A$937)-1","v":3095},0.13449999999999998]
[4547,{"$f":"NETWORKDAYS($B$1,$B$1+A205,Feriados!$A$2:$A$937)-1","v":3126},0.13449999999999998]
[4591,{"$f":"NETWORKDAYS($B$1,$B$1+A206,Feriados!$A$2:$A$937)-1","v":3156},0.1346]
[4680,{"$f":"NETWORKDAYS($B$1,$B$1+A207,Feriados!$A$2:$A$937)-1","v":3217},0.1346]
[4772,{"$f":"NETWORKDAYS($B$1,$B$1+A208,Feriados!$A$2:$A$937)-1","v":3282},0.1346]
[4865,{"$f":"NETWORKDAYS($B$1,$B$1+A209,Feriados!$A$2:$A$937)-1","v":3345},0.13470000000000001]
[4912,{"$f":"NETWORKDAYS($B$1,$B$1+A210,Feriados!$A$2:$A$937)-1","v":3376},0.13470000000000001]
[4956,{"$f":"NETWORKDAYS($B$1,$B$1+A211,Feriados!$A$2:$A$937)-1","v":3408},0.13470000000000001]
[5040,{"$f":"NETWORKDAYS($B$1,$B$1+A212,Feriados!$A$2:$A$937)-1","v":3463},0.13470000000000001]
[5046,{"$f":"NETWORKDAYS($B$1,$B$1+A213,Feriados!$A$2:$A$937)-1","v":3467},0.13470000000000001]
[5138,{"$f":"NETWORKDAYS($B$1,$B$1+A214,Feriados!$A$2:$A$937)-1","v":3532},0.13470000000000001]
[5232,{"$f":"NETWORKDAYS($B$1,$B$1+A215,Feriados!$A$2:$A$937)-1","v":3598},0.13470000000000001]
[5278,{"$f":"NETWORKDAYS($B$1,$B$1+A216,Feriados!$A$2:$A$937)-1","v":3630},0.13470000000000001]
[5325,{"$f":"NETWORKDAYS($B$1,$B$1+A217,Feriados!$A$2:$A$937)-1","v":3661},0.13470000000000001]
[5400,{"$f":"NETWORKDAYS($B$1,$B$1+A218,Feriados!$A$2:$A$937)-1","v":3711},0.13470000000000001]
[5411,{"$f":"NETWORKDAYS($B$1,$B$1+A219,Feriados!$A$2:$A$937)-1","v":3720},0.13470000000000001]
[5505,{"$f":"NETWORKDAYS($B$1,$B$1+A220,Feriados!$A$2:$A$937)-1","v":3785},0.13470000000000001]
[5583,{"$f":"NETWORKDAYS($B$1,$B$1+A221,Feriados!$A$2:$A$937)-1","v":3838},0.13470000000000001]
[5596,{"$f":"NETWORKDAYS($B$1,$B$1+A222,Feriados!$A$2:$A$937)-1","v":3847},0.13470000000000001]
[5687,{"$f":"NETWORKDAYS($B$1,$B$1+A223,Feriados!$A$2:$A$937)-1","v":3910},0.13470000000000001]
[5778,{"$f":"NETWORKDAYS($B$1,$B$1+A224,Feriados!$A$2:$A$937)-1","v":3971},0.13470000000000001]
[5869,{"$f":"NETWORKDAYS($B$1,$B$1+A225,Feriados!$A$2:$A$937)-1","v":4035},0.13470000000000001]
[5961,{"$f":"NETWORKDAYS($B$1,$B$1+A226,Feriados!$A$2:$A$937)-1","v":4097},0.13470000000000001]
[6052,{"$f":"NETWORKDAYS($B$1,$B$1+A227,Feriados!$A$2:$A$937)-1","v":4162},0.13470000000000001]
[6142,{"$f":"NETWORKDAYS($B$1,$B$1+A228,Feriados!$A$2:$A$937)-1","v":4222},0.13470000000000001]
[6233,{"$f":"NETWORKDAYS($B$1,$B$1+A229,Feriados!$A$2:$A$937)-1","v":4286},0.13470000000000001]
[6326,{"$f":"NETWORKDAYS($B$1,$B$1+A230,Feriados!$A$2:$A$937)-1","v":4349},0.13470000000000001]
[6417,{"$f":"NETWORKDAYS($B$1,$B$1+A231,Feriados!$A$2:$A$937)-1","v":4412},0.13470000000000001]
[6507,{"$f":"NETWORKDAYS($B$1,$B$1+A232,Feriados!$A$2:$A$937)-1","v":4474},0.13470000000000001]
[6599,{"$f":"NETWORKDAYS($B$1,$B$1+A233,Feriados!$A$2:$A$937)-1","v":4539},0.13470000000000001]
[6692,{"$f":"NETWORKDAYS($B$1,$B$1+A234,Feriados!$A$2:$A$937)-1","v":4602},0.13470000000000001]
[6783,{"$f":"NETWORKDAYS($B$1,$B$1+A235,Feriados!$A$2:$A$937)-1","v":4665},0.13470000000000001]
[6872,{"$f":"NETWORKDAYS($B$1,$B$1+A236,Feriados!$A$2:$A$937)-1","v":4724},0.13470000000000001]
[6964,{"$f":"NETWORKDAYS($B$1,$B$1+A237,Feriados!$A$2:$A$937)-1","v":4789},0.13470000000000001]
[7059,{"$f":"NETWORKDAYS($B$1,$B$1+A238,Feriados!$A$2:$A$937)-1","v":4855},0.13470000000000001]
[7152,{"$f":"NETWORKDAYS($B$1,$B$1+A239,Feriados!$A$2:$A$937)-1","v":4918},0.13470000000000001]
[7200,{"$f":"NETWORKDAYS($B$1,$B$1+A240,Feriados!$A$2:$A$937)-1","v":4951},0.13470000000000001]
[7237,{"$f":"NETWORKDAYS($B$1,$B$1+A241,Feriados!$A$2:$A$937)-1","v":4976},0.13470000000000001]
[7329,{"$f":"NETWORKDAYS($B$1,$B$1+A242,Feriados!$A$2:$A$937)-1","v":5041},0.13470000000000001]
[7423,{"$f":"NETWORKDAYS($B$1,$B$1+A243,Feriados!$A$2:$A$937)-1","v":5107},0.13470000000000001]
[7514,{"$f":"NETWORKDAYS($B$1,$B$1+A244,Feriados!$A$2:$A$937)-1","v":5168},0.13470000000000001]
[7602,{"$f":"NETWORKDAYS($B$1,$B$1+A245,Feriados!$A$2:$A$937)-1","v":5229},0.13470000000000001]
[7696,{"$f":"NETWORKDAYS($B$1,$B$1+A246,Feriados!$A$2:$A$937)-1","v":5294},0.13470000000000001]
[7787,{"$f":"NETWORKDAYS($B$1,$B$1+A247,Feriados!$A$2:$A$937)-1","v":5356},0.13470000000000001]
[7878,{"$f":"NETWORKDAYS($B$1,$B$1+A248,Feriados!$A$2:$A$937)-1","v":5419},0.13470000000000001]
[7969,{"$f":"NETWORKDAYS($B$1,$B$1+A249,Feriados!$A$2:$A$937)-1","v":5480},0.13470000000000001]
[8060,{"$f":"NETWORKDAYS($B$1,$B$1+A250,Feriados!$A$2:$A$937)-1","v":5544},0.13470000000000001]
[8153,{"$f":"NETWORKDAYS($B$1,$B$1+A251,Feriados!$A$2:$A$937)-1","v":5607},0.13470000000000001]
[8244,{"$f":"NETWORKDAYS($B$1,$B$1+A252,Feriados!$A$2:$A$937)-1","v":5672},0.13470000000000001]
[8333,{"$f":"NETWORKDAYS($B$1,$B$1+A253,Feriados!$A$2:$A$937)-1","v":5730},0.13470000000000001]
[8425,{"$f":"NETWORKDAYS($B$1,$B$1+A254,Feriados!$A$2:$A$937)-1","v":5795},0.13470000000000001]
[8609,{"$f":"NETWORKDAYS($B$1,$B$1+A255,Feriados!$A$2:$A$937)-1","v":5919},0.13470000000000001]
[8790,{"$f":"NETWORKDAYS($B$1,$B$1+A256,Feriados!$A$2:$A$937)-1","v":6045},0.13470000000000001]
[8974,{"$f":"NETWORKDAYS($B$1,$B$1+A257,Feriados!$A$2:$A$937)-1","v":6171},0.13470000000000001]
[9000,{"$f":"NETWORKDAYS($B$1,$B$1+A258,Feriados!$A$2:$A$937)-1","v":6187},0.13470000000000001]
[9155,{"$f":"NETWORKDAYS($B$1,$B$1+A259,Feriados!$A$2:$A$937)-1","v":6295},0.13470000000000001]
[9343,{"$f":"NETWORKDAYS($B$1,$B$1+A260,Feriados!$A$2:$A$937)-1","v":6424},0.13470000000000001]
[9523,{"$f":"NETWORKDAYS($B$1,$B$1+A261,Feriados!$A$2:$A$937)-1","v":6548},0.13470000000000001]
[9705,{"$f":"NETWORKDAYS($B$1,$B$1+A262,Feriados!$A$2:$A$937)-1","v":6673},0.13470000000000001]
[9887,{"$f":"NETWORKDAYS($B$1,$B$1+A263,Feriados!$A$2:$A$937)-1","v":6798},0.13470000000000001]
[10070,{"$f":"NETWORKDAYS($B$1,$B$1+A264,Feriados!$A$2:$A$937)-1","v":6925},0.13470000000000001]
[10251,{"$f":"NETWORKDAYS($B$1,$B$1+A265,Feriados!$A$2:$A$937)-1","v":7049},0.13470000000000001]
[10800,{"$f":"NETWORKDAYS($B$1,$B$1+A266,Feriados!$A$2:$A$937)-1","v":7426},0.13470000000000001]
[11987,{"$f":"NETWORKDAYS($B$1,$B$1+A267,Feriados!$A$2:$A$937)-1","v":8242},0.13470000000000001]
[13905,{"$f":"NETWORKDAYS($B$1,$B$1+A268,Feriados!$A$2:$A$937)-1","v":9563},0.13470000000000001]

{"sheet":"ETTJ x Contratos em Aberto","index":3,"n_rows":40,"n_cols":23,"rows_kept":40,"cut":false,"hidden":false,"merged":[]}
[]
[null,null,null,null,null,null,null,null,null,null,null,"Min. Liquidez Desejada",null,1500000,null,null,"Vencimento","Série","Taxa","Contratos","DV01",null,0]
[null,null,null,null,null,null,null,null,null,null,null,null,null,null,null,null,{"$f":"Resumo!D4","v":"2022-08-01"},{"$f":"Resumo!B4","v":"Q22"},{"$f":"Resumo!G4","v":0.13149999999999706},{"$f":"IF(Resumo!H4>'ETTJ x Contratos em Aberto'!$N$2,Resumo!H4,NA())","v":{"$error":"#N/A"}},{"$f":"IF(Resumo!H4>'ETTJ x Contratos em Aberto'!$N$2,Resumo!J4,NA())","v":{"$error":"#N/A"}},null,500000]
[null,null,null,null,null,null,null,null,null,null,null,null,null,null,null,null,{"$f":"Resumo!D5","v":"2022-09-01"},{"$f":"Resumo!B5","v":"U22"},{"$f":"Resumo!G5","v":0.13479999999999936},{"$f":"IF(Resumo!H5>'ETTJ x Contratos em Aberto'!$N$2,Resumo!H5,NA())","v":{"$error":"#N/A"}},{"$f":"IF(Resumo!H5>'ETTJ x Contratos em Aberto'!$N$2,Resumo!J5,NA())","v":{"$error":"#N/A"}},null,1000000]
[null,null,null,null,null,null,null,null,null,null,null,null,null,null,null,null,{"$f":"Resumo!D6","v":"2022-10-03"},{"$f":"Resumo!B6","v":"V22"},{"$f":"Resumo!G6","v":0.13590000000000013},{"$f":"IF(Resumo!H6>'ETTJ x Contratos em Aberto'!$N$2,Resumo!H6,NA())","v":2231457},{"$f":"IF(Resumo!H6>'ETTJ x Contratos em Aberto'!$N$2,Resumo!J6,NA())","v":-1.7030456001666607},null,1500000]
[null,null,null,null,null,null,null,null,null,null,null,null,null,null,null,null,{"$f":"Resumo!D7","v":"2022-11-01"},{"$f":"Resumo!B7","v":"X22"},{"$f":"Resumo!G7","v":0.1371},{"$f":"IF(Resumo!H7>'ETTJ x Contratos em Aberto'!$N$2,Resumo!H7,NA())","v":{"$error":"#N/A"}},{"$f":"IF(Resumo!H7>'ETTJ x Contratos em Aberto'!$N$2,Resumo!J7,NA())","v":{"$error":"#N/A"}},null,2000000]
[null,null,null,null,null,null,null,null,null,null,null,null,null,null,null,null,{"$f":"Resumo!D8","v":"2022-12-01"},{"$f":"Resumo!B8","v":"Z22"},{"$f":"Resumo!G8","v":0.1379999999999999},{"$f":"IF(Resumo!H8>'ETTJ x Contratos em Aberto'!$N$2,Resumo!H8,NA())","v":{"$error":"#N/A"}},{"$f":"IF(Resumo!H8>'ETTJ x Contratos em Aberto'!$N$2,Resumo!J8,NA())","v":{"$error":"#N/A"}},null,3000000]
[null,null,null,null,null,null,null,null,null,null,null,null,null,null,null,null,{"$f":"Resumo!D9","v":"2023-01-02"},{"$f":"Resumo!B9","v":"F23"},{"$f":"Resumo!G9","v":0.13859999999999983},{"$f":"IF(Resumo!H9>'ETTJ x Contratos em Aberto'!$N$2,Resumo!H9,NA())","v":5413628},{"$f":"IF(Resumo!H9>'ETTJ x Contratos em Aberto'!$N$2,Resumo!J9,NA())","v":-3.6843840908259153}]
[null,null,null,null,null,null,null,null,null,null,null,null,null,null,null,null,{"$f":"Resumo!D10","v":"2023-02-01"},{"$f":"Resumo!B10","v":"G23"},{"$f":"Resumo!G10","v":0.13900000000000001},{"$f":"IF(Resumo!H10>'ETTJ x Contratos em Aberto'!$N$2,Resumo!H10,NA())","v":{"$error":"#N/A"}},{"$f":"IF(Resumo!H10>'ETTJ x Contratos em Aberto'!$N$2,Resumo!J10,NA())","v":{"$error":"#N/A"}}]
[null,null,null,null,null,null,null,null,null,null,null,null,null,null,null,null,{"$f":"Resumo!D11","v":"2023-03-01"},{"$f":"Resumo!B11","v":"H23"},{"$f":"Resumo!G11","v":0.1391},{"$f":"IF(Resumo!H11>'ETTJ x Contratos em Aberto'!$N$2,Resumo!H11,NA())","v":{"$error":"#N/A"}},{"$f":"IF(Resumo!H11>'ETTJ x Contratos em Aberto'!$N$2,Resumo!J11,NA())","v":{"$error":"#N/A"}}]
[null,null,null,null,null,null,null,null,null,null,null,null,null,null,null,null,{"$f":"Resumo!D12","v":"2023-04-03"},{"$f":"Resumo!B12","v":"J23"},{"$f":"Resumo!G12","v":0.13979999999999992},{"$f":"IF(Resumo!H12>'ETTJ x Contratos em Aberto'!$N$2,Resumo!H12,NA())","v":{"$error":"#N/A"}},{"$f":"IF(Resumo!H12>'ETTJ x Contratos em Aberto'!$N$2,Resumo!J12,NA())","v":{"$error":"#N/A"}}]
[null,null,null,null,null,null,null,null,null,null,null,null,null,null,null,null,{"$f":"Resumo!D13","v":"2023-05-02"},{"$f":"Resumo!B13","v":"K23"},{"$f":"Resumo!G13","v":0.13989999999999991},{"$f":"IF(Resumo!H13>'ETTJ x Contratos em Aberto'!$N$2,Resumo!H13,NA())","v":{"$error":"#N/A"}},{"$f":"IF(Resumo!H13>'ETTJ x Contratos em Aberto'!$N$2,Resumo!J13,NA())","v":{"$error":"#N/A"}}]
[null,null,null,null,null,null,null,null,null,null,null,null,null,null,null,null,{"$f":"Resumo!D14","v":"2023-06-01"},{"$f":"Resumo!B14","v":"M23"},{"$f":"Resumo!G14","v":0.14000000000000012},{"$f":"IF(Resumo!H14>'ETTJ x Contratos em Aberto'!$N$2,Resumo!H14,NA())","v":{"$error":"#N/A"}},{"$f":"IF(Resumo!H14>'ETTJ x Contratos em Aberto'!$N$2,Resumo!J14,NA())","v":{"$error":"#N/A"}}]
[null,null,null,null,null,null,null,null,null,null,null,null,null,null,null,null,{"$f":"Resumo!D15","v":"2023-07-03"},{"$f":"Resumo!B15","v":"N23"},{"$f":"Resumo!G15","v":0.1402000000000001},{"$f":"IF(Resumo!H15>'ETTJ x Contratos em Aberto'!$N$2,Resumo!H15,NA())","v":2172565},{"$f":"IF(Resumo!H15>'ETTJ x Contratos em Aberto'!$N$2,Resumo!J15,NA())","v":-7.2632393155217869}]
[null,null,null,null,null,null,null,null,null,null,null,null,null,null,null,null,{"$f":"Resumo!D16","v":"2023-10-02"},{"$f":"Resumo!B16","v":"V23"},{"$f":"Resumo!G16","v":0.13939999999999997},{"$f":"IF(Resumo!H16>'ETTJ x Contratos em Aberto'!$N$2,Resumo!H16,NA())","v":{"$error":"#N/A"}},{"$f":"IF(Resumo!H16>'ETTJ x Contratos em Aberto'!$N$2,Resumo!J16,NA())","v":{"$error":"#N/A"}}]
[null,null,null,null,null,null,null,null,null,null,null,null,null,null,null,null,{"$f":"Resumo!D17","v":"2024-01-02"},{"$f":"Resumo!B17","v":"F24"},{"$f":"Resumo!G17","v":0.13810000000000011},{"$f":"IF(Resumo!H17>'ETTJ x Contratos em Aberto'!$N$2,Resumo!H17,NA())","v":3745488},{"$f":"IF(Resumo!H17>'ETTJ x Contratos em Aberto'!$N$2,Resumo!J17,NA())","v":-10.456808189366711}]
[null,null,null,null,null,null,null,null,null,null,null,null,null,null,null,null,{"$f":"Resumo!D18","v":"2024-04-01"},{"$f":"Resumo!B18","v":"J24"},{"$f":"Resumo!G18","v":0.13700000000000001},{"$f":"IF(Resumo!H18>'ETTJ x Contratos em Aberto'!$N$2,Resumo!H18,NA())","v":{"$error":"#N/A"}},{"$f":"IF(Resumo!H18>'ETTJ x Contratos em Aberto'!$N$2,Resumo!J18,NA())","v":{"$error":"#N/A"}}]
[null,null,null,null,null,null,null,null,null,null,null,null,null,null,null,null,{"$f":"Resumo!D19","v":"2024-07-01"},{"$f":"Resumo!B19","v":"N24"},{"$f":"Resumo!G19","v":0.13539999999999996},{"$f":"IF(Resumo!H19>'ETTJ x Contratos em Aberto'!$N$2,Resumo!H19,NA())","v":{"$error":"#N/A"}},{"$f":"IF(Resumo!H19>'ETTJ x Contratos em Aberto'!$N$2,Resumo!J19,NA())","v":{"$error":"#N/A"}}]
[null,null,null,null,null,null,null,null,null,null,null,null,null,null,null,null,{"$f":"Resumo!D20","v":"2024-10-01"},{"$f":"Resumo!B20","v":"V24"},{"$f":"Resumo!G20","v":0.13430000000000009},{"$f":"IF(Resumo!H20>'ETTJ x Contratos em Aberto'!$N$2,Resumo!H20,NA())","v":{"$error":"#N/A"}},{"$f":"IF(Resumo!H20>'ETTJ x Contratos em Aberto'!$N$2,Resumo!J20,NA())","v":{"$error":"#N/A"}}]
[null,null,null,null,null,null,null,null,null,null,null,null,null,null,null,null,{"$f":"Resumo!D21","v":"2025-01-02"},{"$f":"Resumo!B21","v":"F25"},{"$f":"Resumo!G21","v":0.13270000000000004},{"$f":"IF(Resumo!H21>'ETTJ x Contratos em Aberto'!$N$2,Resumo!H21,NA())","v":2743818},{"$f":"IF(Resumo!H21>'ETTJ x Contratos em Aberto'!$N$2,Resumo!J21,NA())","v":-15.893794566494762}]
[null,null,null,null,null,null,null,null,null,null,null,null,null,null,null,null,{"$f":"Resumo!D22","v":"2025-04-01"},{"$f":"Resumo!B22","v":"J25"},{"$f":"Resumo!G22","v":0.13240000000000007},{"$f":"IF(Resumo!H22>'ETTJ x Contratos em Aberto'!$N$2,Resumo!H22,NA())","v":{"$error":"#N/A"}},{"$f":"IF(Resumo!H22>'ETTJ x Contratos em Aberto'!$N$2,Resumo!J22,NA())","v":{"$error":"#N/A"}}]
[null,null,null,null,null,null,null,null,null,null,null,null,null,null,null,null,{"$f":"Resumo!D23","v":"2025-07-01"},{"$f":"Resumo!B23","v":"N25"},{"$f":"Resumo!G23","v":0.13189999999999991},{"$f":"IF(Resumo!H23>'ETTJ x Contratos em Aberto'!$N$2,Resumo!H23,NA())","v":{"$error":"#N/A"}},{"$f":"IF(Resumo!H23>'ETTJ x Contratos em Aberto'!$N$2,Resumo!J23,NA())","v":{"$error":"#N/A"}}]
[null,null,null,null,null,null,null,null,null,null,null,null,null,null,null,null,{"$f":"Resumo!D24","v":"2025-10-01"},{"$f":"Resumo!B24","v":"V25"},{"$f":"Resumo!G24","v":0.1322000000000001},{"$f":"IF(Resumo!H24>'ETTJ x Contratos em Aberto'!$N$2,Resumo!H24,NA())","v":{"$error":"#N/A"}},{"$f":"IF(Resumo!H24>'ETTJ x Contratos em Aberto'!$N$2,Resumo!J24,NA())","v":{"$error":"#N/A"}}]
[null,null,null,null,null,null,null,null,null,null,null,null,null,null,null,null,{"$f":"Resumo!D25","v":"2026-01-02"},{"$f":"Resumo!B25","v":"F26"},{"$f":"Resumo!G25","v":0.13179999999999992},{"$f":"IF(Resumo!H25>'ETTJ x Contratos em Aberto'!$N$2,Resumo!H25,NA())","v":{"$error":"#N/A"}},{"$f":"IF(Resumo!H25>'ETTJ x Contratos em Aberto'!$N$2,Resumo!J25,NA())","v":{"$error":"#N/A"}}]
[null,null,null,null,null,null,null,null,null,null,null,null,null,null,null,null,{"$f":"Resumo!D26","v":"2026-04-01"},{"$f":"Resumo!B26","v":"J26"},{"$f":"Resumo!G26","v":0.13189999999999991},{"$f":"IF(Resumo!H26>'ETTJ x Contratos em Aberto'!$N$2,Resumo!H26,NA())","v":{"$error":"#N/A"}},{"$f":"IF(Resumo!H26>'ETTJ x Contratos em Aberto'!$N$2,Resumo!J26,NA())","v":{"$error":"#N/A"}}]
[null,null,null,null,null,null,null,null,null,null,null,null,null,null,null,null,{"$f":"Resumo!D27","v":"2026-07-01"},{"$f":"Resumo!B27","v":"N26"},{"$f":"Resumo!G27","v":0.13179999999999992},{"$f":"IF(Resumo!H27>'ETTJ x Contratos em Aberto'!$N$2,Resumo!H27,NA())","v":{"$error":"#N/A"}},{"$f":"IF(Resumo!H27>'ETTJ x Contratos em Aberto'!$N$2,Resumo!J27,NA())","v":{"$error":"#N/A"}}]
[null,null,null,null,null,null,null,null,null,null,null,null,null,null,null,null,{"$f":"Resumo!D28","v":"2026-10-01"},{"$f":"Resumo!B28","v":"V26"},{"$f":"Resumo!G28","v":0.13270000000000004},{"$f":"IF(Resumo!H28>'ETTJ x Contratos em Aberto'!$N$2,Resumo!H28,NA())","v":{"$error":"#N/A"}},{"$f":"IF(Resumo!H28>'ETTJ x Contratos em Aberto'!$N$2,Resumo!J28,NA())","v":{"$error":"#N/A"}}]
[null,null,null,null,null,null,null,null,null,null,null,null,null,null,null,null,{"$f":"Resumo!D29","v":"2027-01-04"},{"$f":"Resumo!B29","v":"F27"},{"$f":"Resumo!G29","v":0.13240000000000007},{"$f":"IF(Resumo!H29>'ETTJ x Contratos em Aberto'!$N$2,Resumo!H29,NA())","v":{"$error":"#N/A"}},{"$f":"IF(Resumo!H29>'ETTJ x Contratos em Aberto'!$N$2,Resumo!J29,NA())","v":{"$error":"#N/A"}}]
[null,null,null,null,null,null,null,null,null,null,null,null,null,null,null,null,{"$f":"Resumo!D30","v":"2027-04-01"},{"$f":"Resumo!B30","v":"J27"},{"$f":"Resumo!G30","v":0.1322000000000001},{"$f":"IF(Resumo!H30>'ETTJ x Contratos em Aberto'!$N$2,Resumo!H30,NA())","v":{"$error":"#N/A"}},{"$f":"IF(Resumo!H30>'ETTJ x Contratos em Aberto'!$N$2,Resumo!J30,NA())","v":{"$error":"#N/A"}}]
[null,null,null,null,null,null,null,null,null,null,null,null,null,null,null,null,{"$f":"Resumo!D31","v":"2027-07-01"},{"$f":"Resumo!B31","v":"N27"},{"$f":"Resumo!G31","v":0.13260000000000005},{"$f":"IF(Resumo!H31>'ETTJ x Contratos em Aberto'!$N$2,Resumo!H31,NA())","v":{"$error":"#N/A"}},{"$f":"IF(Resumo!H31>'ETTJ x Contratos em Aberto'!$N$2,Resumo!J31,NA())","v":{"$error":"#N/A"}}]
[null,null,null,null,null,null,null,null,null,null,null,null,null,null,null,null,{"$f":"Resumo!D32","v":"2028-01-03"},{"$f":"Resumo!B32","v":"F28"},{"$f":"Resumo!G32","v":0.13280000000000003},{"$f":"IF(Resumo!H32>'ETTJ x Contratos em Aberto'!$N$2,Resumo!H32,NA())","v":{"$error":"#N/A"}},{"$f":"IF(Resumo!H32>'ETTJ x Contratos em Aberto'!$N$2,Resumo!J32,NA())","v":{"$error":"#N/A"}}]
[null,null,null,null,null,null,null,null,null,null,null,null,null,null,null,null,{"$f":"Resumo!D33","v":"2029-01-02"},{"$f":"Resumo!B33","v":"F29"},{"$f":"Resumo!G33","v":0.13339999999999996},{"$f":"IF(Resumo!H33>'ETTJ x Contratos em Aberto'!$N$2,Resumo!H33,NA())","v":{"$error":"#N/A"}},{"$f":"IF(Resumo!H33>'ETTJ x Contratos em Aberto'!$N$2,Resumo!J33,NA())","v":{"$error":"#N/A"}}]
[null,null,null,null,null,null,null,null,null,null,null,null,null,null,null,null,{"$f":"Resumo!D34","v":"2030-01-02"},{"$f":"Resumo!B34","v":"F30"},{"$f":"Resumo!G34","v":0.13359999999999994},{"$f":"IF(Resumo!H34>'ETTJ x Contratos em Aberto'!$N$2,Resumo!H34,NA())","v":{"$error":"#N/A"}},{"$f":"IF(Resumo!H34>'ETTJ x Contratos em Aberto'!$N$2,Resumo!J34,NA())","v":{"$error":"#N/A"}}]
[null,null,null,null,null,null,null,null,null,null,null,null,null,null,null,null,{"$f":"Resumo!D35","v":"2031-01-02"},{"$f":"Resumo!B35","v":"F31"},{"$f":"Resumo!G35","v":0.1339999999999999},{"$f":"IF(Resumo!H35>'ETTJ x Contratos em Aberto'!$N$2,Resumo!H35,NA())","v":{"$error":"#N/A"}},{"$f":"IF(Resumo!H35>'ETTJ x Contratos em Aberto'!$N$2,Resumo!J35,NA())","v":{"$error":"#N/A"}}]
[null,null,null,null,null,null,null,null,null,null,null,null,null,null,null,null,{"$f":"Resumo!D36","v":"2032-01-02"},{"$f":"Resumo!B36","v":"F32"},{"$f":"Resumo!G36","v":0.13410000000000011},{"$f":"IF(Resumo!H36>'ETTJ x Contratos em Aberto'!$N$2,Resumo!H36,NA())","v":{"$error":"#N/A"}},{"$f":"IF(Resumo!H36>'ETTJ x Contratos em Aberto'!$N$2,Resumo!J36,NA())","v":{"$error":"#N/A"}}]
[null,null,null,null,null,null,null,null,null,null,null,null,null,null,null,null,{"$f":"Resumo!D37","v":"2033-01-03"},{"$f":"Resumo!B37","v":"F33"},{"$f":"Resumo!G37","v":0.13430000000000009},{"$f":"IF(Resumo!H37>'ETTJ x Contratos em Aberto'!$N$2,Resumo!H37,NA())","v":{"$error":"#N/A"}},{"$f":"IF(Resumo!H37>'ETTJ x Contratos em Aberto'!$N$2,Resumo!J37,NA())","v":{"$error":"#N/A"}}]
[null,null,null,null,null,null,null,null,null,null,null,null,null,null,null,null,{"$f":"Resumo!D38","v":"2034-01-02"},{"$f":"Resumo!B38","v":"F34"},{"$f":"Resumo!G38","v":0.13450000000000006},{"$f":"IF(Resumo!H38>'ETTJ x Contratos em Aberto'!$N$2,Resumo!H38,NA())","v":{"$error":"#N/A"}},{"$f":"IF(Resumo!H38>'ETTJ x Contratos em Aberto'!$N$2,Resumo!J38,NA())","v":{"$error":"#N/A"}}]
[null,null,null,null,null,null,null,null,null,null,null,null,null,null,null,null,{"$f":"Resumo!D39","v":"2035-01-02"},{"$f":"Resumo!B39","v":"F35"},{"$f":"Resumo!G39","v":0.13450000000000006},{"$f":"IF(Resumo!H39>'ETTJ x Contratos em Aberto'!$N$2,Resumo!H39,NA())","v":{"$error":"#N/A"}},{"$f":"IF(Resumo!H39>'ETTJ x Contratos em Aberto'!$N$2,Resumo!J39,NA())","v":{"$error":"#N/A"}}]
[null,null,null,null,null,null,null,null,null,null,null,null,null,null,null,null,{"$f":"Resumo!D40","v":"2036-01-02"},{"$f":"Resumo!B40","v":"F36"},{"$f":"Resumo!G40","v":0.13470000000000004},{"$f":"IF(Resumo!H40>'ETTJ x Contratos em Aberto'!$N$2,Resumo!H40,NA())","v":{"$error":"#N/A"}},{"$f":"IF(Resumo!H40>'ETTJ x Contratos em Aberto'!$N$2,Resumo!J40,NA())","v":{"$error":"#N/A"}}]
[null,null,null,null,null,null,null,null,null,null,null,null,null,null,null,null,{"$f":"Resumo!D41","v":"2037-01-02"},{"$f":"Resumo!B41","v":"F37"},{"$f":"Resumo!G41","v":0.13470000000000004},{"$f":"IF(Resumo!H41>'ETTJ x Contratos em Aberto'!$N$2,Resumo!H41,NA())","v":{"$error":"#N/A"}},{"$f":"IF(Resumo!H41>'ETTJ x Contratos em Aberto'!$N$2,Resumo!J41,NA())","v":{"$error":"#N/A"}}]

{"sheet":"Anbima LTN","index":4,"n_rows":19,"n_cols":35,"rows_kept":19,"cut":false,"hidden":false,"merged":[[3,6,4,6],[3,7,3,10],[0,0,0,9],[1,0,1,10],[2,0,2,1],[2,2,2,10],[3,0,4,0],[3,1,4,1],[3,2,4,2],[3,3,4,3],[3,4,4,4],[3,5,4,5]]}
["Títulos Públicos Federais",null,null,null,null,null,null,null,null,null,"2022-07-22"]
[null,null,null,null,null,null,null,null,null,null,null,null,null,null,null,null,null,null,null,null,null,null,null,null,null,null,null,null,null,"Escolha do Papel",null,null,"Preço=f(i)"]
["Papel PREFIXADO",null,"LTN - Taxa (% a.a.)/252",null,null,null,null,null,null,null,null,null,null,null,null,null,null,null,null,null,null,null,null,null,null,null,null,null,null,"LTN","2026-01-01",null,"i (% a.a.)","Preço"]
["Código SELIC","Data Base/Emissão","Data de Vencimento","Tx. Compra","Tx. Venda","Tx. Indicativas","PU","Intervalo Indicativo",null,null,null,null,"Vencimento","Liquidação","Dias","Taxa Pré LTN","Preço","Taxa Pré B3","Spread",null,null,null,null,null,null,null,null,null,null,"Vencimento",{"$f":"VLOOKUP(AE3,$M$6:$S$17,2,FALSE)","v":"2026-01-02"},null,{"$f":"AG5-1%","v":5.319400000000004E-2},{"$f":"1000/(1+AG4)^($AE$5/252)","v":836.51002172907477}]
[null,null,null,null,null,null,null,"Mínimo (D0)","Máximo (D0)","Mínimo (D+1)","Máximo (D+1)",null,null,null,"Úteis","(% a.a.)",null,"(% a.a.)","(% a.a.)",null,null,null,null,null,null,null,null,null,null,"Prazo (DU)",{"$f":"VLOOKUP(AE3,$M$6:$S$17,3,FALSE)","v":868},null,6.3194000000000042E-2,{"$f":"1000/(1+AG5)^($AE$5/252)","v":809.71962158511337}]
[100000,"2020-07-03","2022-10-01",13.622299999999999,13.6027,13.612500000000001,974.99582099999998,13.484500000000001,13.9483,13.488099999999999,13.9511,null,{"$f":"C6","v":"2022-10-01"},{"$f":"WORKDAY(M6-1,1,Feriados!$A$2:$A$937)","v":"2022-10-03"},{"$f":"NETWORKDAYS($K$1,N6,Feriados!$A$2:$A$937)-1","v":50},{"$f":"F6/100","v":0.136125},{"$f":"1000/(1+P6)^(O6/252)","v":974.99582197609925},{"$f":"InterpolaPre(O6)","v":0.13590000000000013},{"$f":"(1+P6)/(1+R6)-1","v":1.9808081697325619E-4},null,null,null,null,null,null,null,null,null,null,"Taxa (% a.a.)",{"$f":"VLOOKUP(AE3,$M$6:$S$17,4,FALSE)","v":0.13319400000000001},null,7.3194000000000037E-2,784.02610022789383]
[100000,"2016-01-20","2023-01-01",13.886699999999999,13.8687,13.878,943.87749299999996,13.7529,14.377599999999999,13.7111,14.3307,null,{"$f":"C7","v":"2023-01-01"},{"$f":"WORKDAY(M7-1,1,Feriados!$A$2:$A$937)","v":"2023-01-02"},{"$f":"NETWORKDAYS($K$1,N7,Feriados!$A$2:$A$937)-1","v":112},{"$f":"F7/100","v":0.13878000000000001},{"$f":"1000/(1+P7)^(O7/252)","v":943.87749351571324},{"$f":"InterpolaPre(O7)","v":0.13859999999999983},{"$f":"(1+P7)/(1+R7)-1","v":1.580888810823744E-4},null,null,null,null,null,null,null,null,null,null,"Preço Unitário",{"$f":"1000/(1+AE6)^(AE5/252)","v":650.05779652662898},null,8.3194000000000032E-2,759.37494663654081]
[100000,"2022-01-07","2023-04-01",14.0055,13.9842,13.995699999999999,913.04906900000003,13.856999999999999,14.6191,13.768000000000001,14.5291,null,"2023-04-01",{"$f":"WORKDAY(M8-1,1,Feriados!$A$2:$A$937)","v":"2023-04-03"},{"$f":"NETWORKDAYS($K$1,N8,Feriados!$A$2:$A$937)-1","v":175},0.139957,913.04906954033993,{"$f":"InterpolaPre(O8)","v":0.13979999999999992},1.3774346376549396E-4,null,null,null,null,null,null,null,null,null,null,"Taxa B3 (% a.a.)",{"$f":"VLOOKUP(AE3,$M$6:$S$17,6,FALSE)","v":0.13179999999999992},null,9.3194000000000027E-2,735.71482731130902]
[100000,"2019-04-05","2023-07-01",14.0557,14.0435,14.05,884.15785100000005,13.925599999999999,14.7469,13.801,14.621600000000001,null,"2023-07-01",{"$f":"WORKDAY(M9-1,1,Feriados!$A$2:$A$937)","v":"2023-07-03"},{"$f":"NETWORKDAYS($K$1,N9,Feriados!$A$2:$A$937)-1","v":236},0.14050000000000001,884.15785198178617,{"$f":"InterpolaPre(O9)","v":0.1402000000000001},2.6311173478332783E-4,null,null,null,null,null,null,null,null,null,null,"Spread (% a.a.)",{"$f":"VLOOKUP(AE3,$M$6:$S$17,7,FALSE)","v":1.2316663721505527E-3},null,0.10319400000000002,712.9973742316979]
[100000,"2022-07-08","2023-10-01",13.981400000000001,13.966900000000001,13.975,855.79456200000004,13.8589,14.733499999999999,13.6989,14.573399999999999,null,"2023-10-01",{"$f":"WORKDAY(M10-1,1,Feriados!$A$2:$A$937)","v":"2023-10-02"},{"$f":"NETWORKDAYS($K$1,N10,Feriados!$A$2:$A$937)-1","v":300},0.13974999999999999,855.79456251684019,{"$f":"InterpolaPre(O10)","v":0.13939999999999997},3.0717921713185881E-4,null,null,null,null,null,null,null,null,null,null,"DV01",{"$f":"1000/(1+AE6+0.01%)^(AE5/252)-1000/(1+AE6)^(AE5/252)","v":-0.1975521354055445},null,0.11319400000000002,691.17698872239737]
[100000,"2020-01-03","2024-01-01",13.8865,13.873900000000001,13.8809,830.10276199999998,13.7841,14.673299999999999,13.6013,14.49,null,"2024-01-01",{"$f":"WORKDAY(M11-1,1,Feriados!$A$2:$A$937)","v":"2024-01-02"},{"$f":"NETWORKDAYS($K$1,N11,Feriados!$A$2:$A$937)-1","v":361},0.13880900000000002,830.10276208721268,{"$f":"InterpolaPre(O11)","v":0.13810000000000011},6.2296810473583264E-4,null,null,null,null,null,null,null,null,null,null,null,null,null,{"$f":"AG12-1%","v":0.12319400000000001},670.21065990407624]
[100000,"2022-01-07","2024-04-01",13.7766,13.766,13.7712,805.69017399999996,13.649100000000001,14.565099999999999,13.467000000000001,14.382300000000001,null,"2024-04-01",{"$f":"WORKDAY(M12-1,1,Feriados!$A$2:$A$937)","v":"2024-04-01"},{"$f":"NETWORKDAYS($K$1,N12,Feriados!$A$2:$A$937)-1","v":422},0.137712,805.69017473475515,{"$f":"InterpolaPre(O12)","v":0.13700000000000001},6.2620932277934749E-4,null,null,null,null,null,null,null,null,null,null,null,null,null,{"$f":"AE6","v":0.13319400000000001},650.05779652662898,{"$f":"AH12","v":650.05779652662898}]
[100000,"2021-01-08","2024-07-01",13.6213,13.608000000000001,13.615,782.18291899999997,13.4437,14.395,13.271800000000001,14.2227,null,"2024-07-01",{"$f":"WORKDAY(M13-1,1,Feriados!$A$2:$A$937)","v":"2024-07-01"},{"$f":"NETWORKDAYS($K$1,N13,Feriados!$A$2:$A$937)-1","v":485},0.13614999999999999,782.18291963336173,{"$f":"InterpolaPre(O13)","v":0.13539999999999996},6.6056015501136933E-4,null,null,null,null,null,null,null,null,null,null,null,null,null,{"$f":"AG12+1%","v":0.14319400000000002},630.68007109117661]
[100000,"2022-07-08","2024-10-01",13.5268,13.5121,13.5189,757.86700499999995,13.295,14.2841,13.1379,14.1264,null,"2024-10-01",{"$f":"WORKDAY(M14-1,1,Feriados!$A$2:$A$937)","v":"2024-10-01"},{"$f":"NETWORKDAYS($K$1,N14,Feriados!$A$2:$A$937)-1","v":551},0.135189,757.86700574809629,{"$f":"InterpolaPre(O14)","v":0.13430000000000009},7.837432777924036E-4,null,null,null,null,null,null,null,null,null,null,null,null,null,{"$f":"AG13+1%","v":0.15319400000000002},612.04127526511013]
[100000,"2018-02-01","2025-01-01",13.346399999999999,13.332800000000001,13.34,736.68033100000002,13.1531,14.1751,12.9285,13.950100000000001,null,"2025-01-01",{"$f":"WORKDAY(M15-1,1,Feriados!$A$2:$A$937)","v":"2025-01-02"},{"$f":"NETWORKDAYS($K$1,N15,Feriados!$A$2:$A$937)-1","v":615},0.13339999999999999,736.680331689843,{"$f":"InterpolaPre(O15)","v":0.13270000000000004},6.1799240752180573E-4,null,null,null,null,null,null,null,null,null,null,null,null,null,0.16319400000000003,594.10718568292998]
[100000,"2022-01-07","2025-07-01",13.3157,13.3057,13.3111,693.86439700000005,13.0479,14.106999999999999,12.857200000000001,13.9162,null,"2025-07-01",{"$f":"WORKDAY(M16-1,1,Feriados!$A$2:$A$937)","v":"2025-07-01"},{"$f":"NETWORKDAYS($K$1,N16,Feriados!$A$2:$A$937)-1","v":737},0.13311100000000001,693.86439722569446,{"$f":"InterpolaPre(O16)","v":0.13189999999999991},1.0698824984540778E-3,null,null,null,null,null,null,null,null,null,null,null,null,null,0.17319400000000004,576.84543930555458]
[100000,"2020-02-03","2026-01-01",13.323700000000001,13.311999999999999,13.3194,650.05779600000005,13.0527,14.1244,12.837999999999999,13.909700000000001,null,"2026-01-01",{"$f":"WORKDAY(M17-1,1,Feriados!$A$2:$A$937)","v":"2026-01-02"},{"$f":"NETWORKDAYS($K$1,N17,Feriados!$A$2:$A$937)-1","v":868},0.13319400000000001,650.05779652662898,{"$f":"InterpolaPre(O17)","v":0.13179999999999992},1.2316663721505527E-3,null,null,null,null,null,null,null,null,null,null,null,null,null,0.18319400000000005,560.22541758304408]
[null,null,null,null,null,null,null,null,null,null,null,null,null,null,null,null,null,null,null,null,null,null,null,null,null,null,null,null,null,null,null,null,0.19319400000000006,544.21813873109545]
[null,null,null,null,null,null,null,null,null,null,null,null,null,null,null,null,null,null,null,null,null,null,null,null,null,null,null,null,null,null,null,null,0.20319400000000007,528.79615749092034]

{"sheet":"Legendas","index":5,"n_rows":19,"n_cols":4,"rows_kept":19,"cut":false,"hidden":false,"merged":[]}
[]
[]
[]
[]
[]
[]
[null,"Código","Mês","Mês Num"]
[null,"F","Janeiro","01"]
[null,"G","Fevereiro","02"]
[null,"H","Março","03"]
[null,"J","Abril","04"]
[null,"K","Maio","05"]
[null,"M","Junho","06"]
[null,"N","Julho","07"]
[null,"Q","Agosto","08"]
[null,"U","Setembro","09"]
[null,"V","Outubro","10"]
[null,"X","Novembro","11"]
[null,"Z","Dezembro","12"]

{"sheet":"Feriados","index":6,"n_rows":938,"n_cols":3,"rows_kept":938,"cut":false,"hidden":false,"merged":[]}
["Data","Dia da Semana","Feriado"]
["2001-01-01","segunda-feira","Confraternização Universal"]
["2001-02-26","segunda-feira","Carnaval"]
["2001-02-27","terça-feira","Carnaval"]
["2001-04-13","sexta-feira","Paixão de Cristo"]
["2001-04-21","sábado","Tiradentes"]
["2001-05-01","terça-feira","Dia do Trabalho"]
["2001-06-14","quinta-feira","Corpus Christi"]
["2001-09-07","sexta-feira","Independência do Brasil"]
["2001-10-12","sexta-feira","Nossa Sr.a Aparecida - Padroeira do Brasil"]
["2001-11-02","sexta-feira","Finados"]
["2001-11-15","quinta-feira","Proclamação da República"]
["2001-12-25","terça-feira","Natal"]
["2002-01-01","terça-feira","Confraternização Universal"]
["2002-02-11","segunda-feira","Carnaval"]
["2002-02-12","terça-feira","Carnaval"]
["2002-03-29","sexta-feira","Paixão de Cristo"]
["2002-04-21","domingo","Tiradentes"]
["2002-05-01","quarta-feira","Dia do Trabalho"]
["2002-05-30","quinta-feira","Corpus Christi"]
["2002-09-07","sábado","Independência do Brasil"]
["2002-10-12","sábado","Nossa Sr.a Aparecida - Padroeira do Brasil"]
["2002-11-02","sábado","Finados"]
["2002-11-15","sexta-feira","Proclamação da República"]
["2002-12-25","quarta-feira","Natal"]
["2003-01-01","quarta-feira","Confraternização Universal"]
["2003-03-03","segunda-feira","Carnaval"]
["2003-03-04","terça-feira","Carnaval"]
["2003-04-18","sexta-feira","Paixão de Cristo"]
["2003-04-21","segunda-feira","Tiradentes"]
["2003-05-01","quinta-feira","Dia do Trabalho"]
["2003-06-19","quinta-feira","Corpus Christi"]
["2003-09-07","domingo","Independência do Brasil"]
["2003-10-12","domingo","Nossa Sr.a Aparecida - Padroeira do Brasil"]
["2003-11-02","domingo","Finados"]
["2003-11-15","sábado","Proclamação da República"]
["2003-12-25","quinta-feira","Natal"]
["2004-01-01","quinta-feira","Confraternização Universal"]
["2004-02-23","segunda-feira","Carnaval"]
["2004-02-24","terça-feira","Carnaval"]
["2004-04-09","sexta-feira","Paixão de Cristo"]
["2004-04-21","quarta-feira","Tiradentes"]
["2004-05-01","sábado","Dia do Trabalho"]
["2004-06-10","quinta-feira","Corpus Christi"]
["2004-09-07","terça-feira","Independência do Brasil"]
["2004-10-12","terça-feira","Nossa Sr.a Aparecida - Padroeira do Brasil"]
["2004-11-02","terça-feira","Finados"]
["2004-11-15","segunda-feira","Proclamação da República"]
["2004-12-25","sábado","Natal"]
["2005-01-01","sábado","Confraternização Universal"]
["2005-02-07","segunda-feira","Carnaval"]
["2005-02-08","terça-feira","Carnaval"]
["2005-03-25","sexta-feira","Paixão de Cristo"]
["2005-04-21","quinta-feira","Tiradentes"]
["2005-05-01","domingo","Dia do Trabalho"]
["2005-05-26","quinta-feira","Corpus Christi"]
["2005-09-07","quarta-feira","Independência do Brasil"]
["2005-10-12","quarta-feira","Nossa Sr.a Aparecida - Padroeira do Brasil"]
["2005-11-02","quarta-feira","Finados"]
["2005-11-15","terça-feira","Proclamação da República"]
["2005-12-25","domingo","Natal"]
["2006-01-01","domingo","Confraternização Universal"]
["2006-02-27","segunda-feira","Carnaval"]
["2006-02-28","terça-feira","Carnaval"]
["2006-04-14","sexta-feira","Paixão de Cristo"]
["2006-04-21","sexta-feira","Tiradentes"]
["2006-05-01","segunda-feira","Dia do Trabalho"]
["2006-06-15","quinta-feira","Corpus Christi"]
["2006-09-07","quinta-feira","Independência do Brasil"]
["2006-10-12","quinta-feira","Nossa Sr.a Aparecida - Padroeira do Brasil"]
["2006-11-02","quinta-feira","Finados"]
["2006-11-15","quarta-feira","Proclamação da República"]
["2006-12-25","segunda-feira","Natal"]
["2007-01-01","segunda-feira","Confraternização Universal"]
["2007-02-19","segunda-feira","Carnaval"]
["2007-02-20","terça-feira","Carnaval"]
["2007-04-06","sexta-feira","Paixão de Cristo"]
["2007-04-21","sábado","Tiradentes"]
["2007-05-01","terça-feira","Dia do Trabalho"]
["2007-06-07","quinta-feira","Corpus Christi"]
["2007-09-07","sexta-feira","Independência do Brasil"]
["2007-10-12","sexta-feira","Nossa Sr.a Aparecida - Padroeira do Brasil"]
["2007-11-02","sexta-feira","Finados"]
["2007-11-15","quinta-feira","Proclamação da República"]
["2007-12-25","terça-feira","Natal"]
["2008-01-01","terça-feira","Confraternização Universal"]
["2008-02-04","segunda-feira","Carnaval"]
["2008-02-05","terça-feira","Carnaval"]
["2008-03-21","sexta-feira","Paixão de Cristo"]
["2008-04-21","segunda-feira","Tiradentes"]
["2008-05-01","quinta-feira","Dia do Trabalho"]
["2008-05-22","quinta-feira","Corpus Christi"]
["2008-09-07","domingo","Independência do Brasil"]
["2008-10-12","domingo","Nossa Sr.a Aparecida - Padroeira do Brasil"]
["2008-11-02","domingo","Finados"]
["2008-11-15","sábado","Proclamação da República"]
["2008-12-25","quinta-feira","Natal"]
["2009-01-01","quinta-feira","Confraternização Universal"]
["2009-02-23","segunda-feira","Carnaval"]
["2009-02-24","terça-feira","Carnaval"]
["2009-04-10","sexta-feira","Paixão de Cristo"]
["2009-04-21","terça-feira","Tiradentes"]
["2009-05-01","sexta-feira","Dia do Trabalho"]
["2009-06-11","quinta-feira","Corpus Christi"]
["2009-09-07","segunda-feira","Independência do Brasil"]
["2009-10-12","segunda-feira","Nossa Sr.a Aparecida - Padroeira do Brasil"]
["2009-11-02","segunda-feira","Finados"]
["2009-11-15","domingo","Proclamação da República"]
["2009-12-25","sexta-feira","Natal"]
["2010-01-01","sexta-feira","Confraternização Universal"]
["2010-02-15","segunda-feira","Carnaval"]
["2010-02-16","terça-feira","Carnaval"]
["2010-04-02","sexta-feira","Paixão de Cristo"]
["2010-04-21","quarta-feira","Tiradentes"]
["2010-05-01","sábado","Dia do Trabalho"]
["2010-06-03","quinta-feira","Corpus Christi"]
["2010-09-07","terça-feira","Independência do Brasil"]
["2010-10-12","terça-feira","Nossa Sr.a Aparecida - Padroeira do Brasil"]
["2010-11-02","terça-feira","Finados"]
["2010-11-15","segunda-feira","Proclamação da República"]
["2010-12-25","sábado","Natal"]
["2011-01-01","sábado","Confraternização Universal"]
["2011-03-07","segunda-feira","Carnaval"]
["2011-03-08","terça-feira","Carnaval"]
["2011-04-21","quinta-feira","Paixão de Cristo"]
["2011-04-22","sexta-feira","Tiradentes"]
["2011-05-01","domingo","Dia do Trabalho"]
["2011-06-23","quinta-feira","Corpus Christi"]
["2011-09-07","quarta-feira","Independência do Brasil"]
["2011-10-12","quarta-feira","Nossa Sr.a Aparecida - Padroeira do Brasil"]
["2011-11-02","quarta-feira","Finados"]
["2011-11-15","terça-feira","Proclamação da República"]
["2011-12-25","domingo","Natal"]
["2012-01-01","domingo","Confraternização Universal"]
["2012-02-20","segunda-feira","Carnaval"]
["2012-02-21","terça-feira","Carnaval"]
["2012-04-06","sexta-feira","Paixão de Cristo"]
["2012-04-21","sábado","Tiradentes"]
["2012-05-01","terça-feira","Dia do Trabalho"]
["2012-06-07","quinta-feira","Corpus Christi"]
["2012-09-07","sexta-feira","Independência do Brasil"]
["2012-10-12","sexta-feira","Nossa Sr.a Aparecida - Padroeira do Brasil"]
["2012-11-02","sexta-feira","Finados"]
["2012-11-15","quinta-feira","Proclamação da República"]
["2012-12-25","terça-feira","Natal"]
["2013-01-01","terça-feira","Confraternização Universal"]
["2013-02-11","segunda-feira","Carnaval"]
["2013-02-12","terça-feira","Carnaval"]
["2013-03-29","sexta-feira","Paixão de Cristo"]
["2013-04-21","domingo","Tiradentes"]
["2013-05-01","quarta-feira","Dia do Trabalho"]
["2013-05-30","quinta-feira","Corpus Christi"]
["2013-09-07","sábado","Independência do Brasil"]
["2013-10-12","sábado","Nossa Sr.a Aparecida - Padroeira do Brasil"]
["2013-11-02","sábado","Finados"]
["2013-11-15","sexta-feira","Proclamação da República"]
["2013-12-25","quarta-feira","Natal"]
["2014-01-01","quarta-feira","Confraternização Universal"]
["2014-03-03","segunda-feira","Carnaval"]
["2014-03-04","terça-feira","Carnaval"]
["2014-04-18","sexta-feira","Paixão de Cristo"]
["2014-04-21","segunda-feira","Tiradentes"]
["2014-05-01","quinta-feira","Dia do Trabalho"]
["2014-06-19","quinta-feira","Corpus Christi"]
["2014-09-07","domingo","Independência do Brasil"]
["2014-10-12","domingo","Nossa Sr.a Aparecida - Padroeira do Brasil"]
["2014-11-02","domingo","Finados"]
["2014-11-15","sábado","Proclamação da República"]
["2014-12-25","quinta-feira","Natal"]
["2015-01-01","quinta-feira","Confraternização Universal"]
["2015-02-16","segunda-feira","Carnaval"]
["2015-02-17","terça-feira","Carnaval"]
["2015-04-03","sexta-feira","Paixão de Cristo"]
["2015-04-21","terça-feira","Tiradentes"]
["2015-05-01","sexta-feira","Dia do Trabalho"]
["2015-06-04","quinta-feira","Corpus Christi"]
["2015-09-07","segunda-feira","Independência do Brasil"]
["2015-10-12","segunda-feira","Nossa Sr.a Aparecida - Padroeira do Brasil"]
["2015-11-02","segunda-feira","Finados"]
["2015-11-15","domingo","Proclamação da República"]
["2015-12-25","sexta-feira","Natal"]
["2016-01-01","sexta-feira","Confraternização Universal"]
["2016-02-08","segunda-feira","Carnaval"]
["2016-02-09","terça-feira","Carnaval"]
["2016-03-25","sexta-feira","Paixão de Cristo"]
["2016-04-21","quinta-feira","Tiradentes"]
["2016-05-01","domingo","Dia do Trabalho"]
["2016-05-26","quinta-feira","Corpus Christi"]
["2016-09-07","quarta-feira","Independência do Brasil"]
["2016-10-12","quarta-feira","Nossa Sr.a Aparecida - Padroeira do Brasil"]
["2016-11-02","quarta-feira","Finados"]
["2016-11-15","terça-feira","Proclamação da República"]
["2016-12-25","domingo","Natal"]
["2017-01-01","domingo","Confraternização Universal"]
["2017-02-27","segunda-feira","Carnaval"]
["2017-02-28","terça-feira","Carnaval"]
["2017-04-14","sexta-feira","Paixão de Cristo"]
["2017-04-21","sexta-feira","Tiradentes"]
["2017-05-01","segunda-feira","Dia do Trabalho"]
["2017-06-15","quinta-feira","Corpus Christi"]
["2017-09-07","quinta-feira","Independência do Brasil"]
["2017-10-12","quinta-feira","Nossa Sr.a Aparecida - Padroeira do Brasil"]
["2017-11-02","quinta-feira","Finados"]
["2017-11-15","quarta-feira","Proclamação da República"]
["2017-12-25","segunda-feira","Natal"]
["2018-01-01","segunda-feira","Confraternização Universal"]
["2018-02-12","segunda-feira","Carnaval"]
["2018-02-13","terça-feira","Carnaval"]
["2018-03-30","sexta-feira","Paixão de Cristo"]
["2018-04-21","sábado","Tiradentes"]
["2018-05-01","terça-feira","Dia do Trabalho"]
["2018-05-31","quinta-feira","Corpus Christi"]
["2018-09-07","sexta-feira","Independência do Brasil"]
["2018-10-12","sexta-feira","Nossa Sr.a Aparecida - Padroeira do Brasil"]
["2018-11-02","sexta-feira","Finados"]
["2018-11-15","quinta-feira","Proclamação da República"]
["2018-12-25","terça-feira","Natal"]
["2019-01-01","terça-feira","Confraternização Universal"]
["2019-03-04","segunda-feira","Carnaval"]
["2019-03-05","terça-feira","Carnaval"]
["2019-04-19","sexta-feira","Paixão de Cristo"]
["2019-04-21","domingo","Tiradentes"]
["2019-05-01","quarta-feira","Dia do Trabalho"]
["2019-06-20","quinta-feira","Corpus Christi"]
["2019-09-07","sábado","Independência do Brasil"]
["2019-10-12","sábado","Nossa Sr.a Aparecida - Padroeira do Brasil"]
["2019-11-02","sábado","Finados"]
["2019-11-15","sexta-feira","Proclamação da República"]
["2019-12-25","quarta-feira","Natal"]
["2020-01-01","quarta-feira","Confraternização Universal"]
["2020-02-24","segunda-feira","Carnaval"]
["2020-02-25","terça-feira","Carnaval"]
["2020-04-10","sexta-feira","Paixão de Cristo"]
["2020-04-21","terça-feira","Tiradentes"]
["2020-05-01","sexta-feira","Dia do Trabalho"]
["2020-06-11","quinta-feira","Corpus Christi"]
["2020-09-07","segunda-feira","Independência do Brasil"]
["2020-10-12","segunda-feira","Nossa Sr.a Aparecida - Padroeira do Brasil"]
["2020-11-02","segunda-feira","Finados"]
["2020-11-15","domingo","Proclamação da República"]
["2020-12-25","sexta-feira","Natal"]
["2021-01-01","sexta-feira","Confraternização Universal"]
["2021-02-15","segunda-feira","Carnaval"]
["2021-02-16","terça-feira","Carnaval"]
["2021-04-02","sexta-feira","Paixão de Cristo"]
["2021-04-21","quarta-feira","Tiradentes"]
["2021-05-01","sábado","Dia do Trabalho"]
["2021-06-03","quinta-feira","Corpus Christi"]
["2021-09-07","terça-feira","Independência do Brasil"]
["2021-10-12","terça-feira","Nossa Sr.a Aparecida - Padroeira do Brasil"]
["2021-11-02","terça-feira","Finados"]
["2021-11-15","segunda-feira","Proclamação da República"]
["2021-12-25","sábado","Natal"]
["2022-01-01","sábado","Confraternização Universal"]
["2022-02-28","segunda-feira","Carnaval"]
["2022-03-01","terça-feira","Carnaval"]
["2022-04-15","sexta-feira","Paixão de Cristo"]
["2022-04-21","quinta-feira","Tiradentes"]
["2022-05-01","domingo","Dia do Trabalho"]
["2022-06-16","quinta-feira","Corpus Christi"]
["2022-09-07","quarta-feira","Independência do Brasil"]
["2022-10-12","quarta-feira","Nossa Sr.a Aparecida - Padroeira do Brasil"]
["2022-11-02","quarta-feira","Finados"]
["2022-11-15","terça-feira","Proclamação da República"]
["2022-12-25","domingo","Natal"]
["2023-01-01","domingo","Confraternização Universal"]
["2023-02-20","segunda-feira","Carnaval"]
["2023-02-21","terça-feira","Carnaval"]
["2023-04-07","sexta-feira","Paixão de Cristo"]
["2023-04-21","sexta-feira","Tiradentes"]
["2023-05-01","segunda-feira","Dia do Trabalho"]
["2023-06-08","quinta-feira","Corpus Christi"]
["2023-09-07","quinta-feira","Independência do Brasil"]
["2023-10-12","quinta-feira","Nossa Sr.a Aparecida - Padroeira do Brasil"]
["2023-11-02","quinta-feira","Finados"]
["2023-11-15","quarta-feira","Proclamação da República"]
["2023-12-25","segunda-feira","Natal"]
["2024-01-01","segunda-feira","Confraternização Universal"]
["2024-02-12","segunda-feira","Carnaval"]
["2024-02-13","terça-feira","Carnaval"]
["2024-03-29","sexta-feira","Paixão de Cristo"]
["2024-04-21","domingo","Tiradentes"]
["2024-05-01","quarta-feira","Dia do Trabalho"]
["2024-05-30","quinta-feira","Corpus Christi"]
["2024-09-07","sábado","Independência do Brasil"]
["2024-10-12","sábado","Nossa Sr.a Aparecida - Padroeira do Brasil"]
["2024-11-02","sábado","Finados"]
["2024-11-15","sexta-feira","Proclamação da República"]
["2024-12-25","quarta-feira","Natal"]
["2025-01-01","quarta-feira","Confraternização Universal"]
["2025-03-03","segunda-feira","Carnaval"]
["2025-03-04","terça-feira","Carnaval"]
["2025-04-18","sexta-feira","Paixão de Cristo"]
["2025-04-21","segunda-feira","Tiradentes"]
["2025-05-01","quinta-feira","Dia do Trabalho"]
["2025-06-19","quinta-feira","Corpus Christi"]
["2025-09-07","domingo","Independência do Brasil"]
["2025-10-12","domingo","Nossa Sr.a Aparecida - Padroeira do Brasil"]
["2025-11-02","domingo","Finados"]
["2025-11-15","sábado","Proclamação da República"]
["2025-12-25","quinta-feira","Natal"]
["2026-01-01","quinta-feira","Confraternização Universal"]
["2026-02-16","segunda-feira","Carnaval"]
["2026-02-17","terça-feira","Carnaval"]
["2026-04-03","sexta-feira","Paixão de Cristo"]
["2026-04-21","terça-feira","Tiradentes"]
["2026-05-01","sexta-feira","Dia do Trabalho"]
["2026-06-04","quinta-feira","Corpus Christi"]
["2026-09-07","segunda-feira","Independência do Brasil"]
["2026-10-12","segunda-feira","Nossa Sr.a Aparecida - Padroeira do Brasil"]
["2026-11-02","segunda-feira","Finados"]
["2026-11-15","domingo","Proclamação da República"]
["2026-12-25","sexta-feira","Natal"]
["2027-01-01","sexta-feira","Confraternização Universal"]
["2027-02-08","segunda-feira","Carnaval"]
["2027-02-09","terça-feira","Carnaval"]
["2027-03-26","sexta-feira","Paixão de Cristo"]
["2027-04-21","quarta-feira","Tiradentes"]
["2027-05-01","sábado","Dia do Trabalho"]
["2027-05-27","quinta-feira","Corpus Christi"]
["2027-09-07","terça-feira","Independência do Brasil"]
["2027-10-12","terça-feira","Nossa Sr.a Aparecida - Padroeira do Brasil"]
["2027-11-02","terça-feira","Finados"]
["2027-11-15","segunda-feira","Proclamação da República"]
["2027-12-25","sábado","Natal"]
["2028-01-01","sábado","Confraternização Universal"]
["2028-02-28","segunda-feira","Carnaval"]
["2028-02-29","terça-feira","Carnaval"]
["2028-04-14","sexta-feira","Paixão de Cristo"]
["2028-04-21","sexta-feira","Tiradentes"]
["2028-05-01","segunda-feira","Dia do Trabalho"]
["2028-06-15","quinta-feira","Corpus Christi"]
["2028-09-07","quinta-feira","Independência do Brasil"]
["2028-10-12","quinta-feira","Nossa Sr.a Aparecida - Padroeira do Brasil"]
["2028-11-02","quinta-feira","Finados"]
["2028-11-15","quarta-feira","Proclamação da República"]
["2028-12-25","segunda-feira","Natal"]
["2029-01-01","segunda-feira","Confraternização Universal"]
["2029-02-12","segunda-feira","Carnaval"]
["2029-02-13","terça-feira","Carnaval"]
["2029-03-30","sexta-feira","Paixão de Cristo"]
["2029-04-21","sábado","Tiradentes"]
["2029-05-01","terça-feira","Dia do Trabalho"]
["2029-05-31","quinta-feira","Corpus Christi"]
["2029-09-07","sexta-feira","Independência do Brasil"]
["2029-10-12","sexta-feira","Nossa Sr.a Aparecida - Padroeira do Brasil"]
["2029-11-02","sexta-feira","Finados"]
["2029-11-15","quinta-feira","Proclamação da República"]
["2029-12-25","terça-feira","Natal"]
["2030-01-01","terça-feira","Confraternização Universal"]
["2030-03-04","segunda-feira","Carnaval"]
["2030-03-05","terça-feira","Carnaval"]
["2030-04-19","sexta-feira","Paixão de Cristo"]
["2030-04-21","domingo","Tiradentes"]
["2030-05-01","quarta-feira","Dia do Trabalho"]
["2030-06-20","quinta-feira","Corpus Christi"]
["2030-09-07","sábado","Independência do Brasil"]
["2030-10-12","sábado","Nossa Sr.a Aparecida - Padroeira do Brasil"]
["2030-11-02","sábado","Finados"]
["2030-11-15","sexta-feira","Proclamação da República"]
["2030-12-25","quarta-feira","Natal"]
["2031-01-01","quarta-feira","Confraternização Universal"]
["2031-02-24","segunda-feira","Carnaval"]
["2031-02-25","terça-feira","Carnaval"]
["2031-04-11","sexta-feira","Paixão de Cristo"]
["2031-04-21","segunda-feira","Tiradentes"]
["2031-05-01","quinta-feira","Dia do Trabalho"]
["2031-06-12","quinta-feira","Corpus Christi"]
["2031-09-07","domingo","Independência do Brasil"]
["2031-10-12","domingo","Nossa Sr.a Aparecida - Padroeira do Brasil"]
["2031-11-02","domingo","Finados"]
["2031-11-15","sábado","Proclamação da República"]
["2031-12-25","quinta-feira","Natal"]
["2032-01-01","quinta-feira","Confraternização Universal"]
["2032-02-09","segunda-feira","Carnaval"]
["2032-02-10","terça-feira","Carnaval"]
["2032-03-26","sexta-feira","Paixão de Cristo"]
["2032-04-21","quarta-feira","Tiradentes"]
["2032-05-01","sábado","Dia do Trabalho"]
["2032-05-27","quinta-feira","Corpus Christi"]
["2032-09-07","terça-feira","Independência do Brasil"]
["2032-10-12","terça-feira","Nossa Sr.a Aparecida - Padroeira do Brasil"]
["2032-11-02","terça-feira","Finados"]
["2032-11-15","segunda-feira","Proclamação da República"]
["2032-12-25","sábado","Natal"]
["2033-01-01","sábado","Confraternização Universal"]
["2033-02-28","segunda-feira","Carnaval"]
["2033-03-01","terça-feira","Carnaval"]
["2033-04-15","sexta-feira","Paixão de Cristo"]
["2033-04-21","quinta-feira","Tiradentes"]
["2033-05-01","domingo","Dia do Trabalho"]
["2033-06-16","quinta-feira","Corpus Christi"]
["2033-09-07","quarta-feira","Independência do Brasil"]
["2033-10-12","quarta-feira","Nossa Sr.a Aparecida - Padroeira do Brasil"]
["2033-11-02","quarta-feira","Finados"]
["2033-11-15","terça-feira","Proclamação da República"]
["2033-12-25","domingo","Natal"]
["2034-01-01","domingo","Confraternização Universal"]
["2034-02-20","segunda-feira","Carnaval"]
["2034-02-21","terça-feira","Carnaval"]
["2034-04-07","sexta-feira","Paixão de Cristo"]
["2034-04-21","sexta-feira","Tiradentes"]
["2034-05-01","segunda-feira","Dia do Trabalho"]
["2034-06-08","quinta-feira","Corpus Christi"]
["2034-09-07","quinta-feira","Independência do Brasil"]
["2034-10-12","quinta-feira","Nossa Sr.a Aparecida - Padroeira do Brasil"]
["2034-11-02","quinta-feira","Finados"]
["2034-11-15","quarta-feira","Proclamação da República"]
["2034-12-25","segunda-feira","Natal"]
["2035-01-01","segunda-feira","Confraternização Universal"]
["2035-02-05","segunda-feira","Carnaval"]
["2035-02-06","terça-feira","Carnaval"]
["2035-03-23","sexta-feira","Paixão de Cristo"]
["2035-04-21","sábado","Tiradentes"]
["2035-05-01","terça-feira","Dia do Trabalho"]
["2035-05-24","quinta-feira","Corpus Christi"]
["2035-09-07","sexta-feira","Independência do Brasil"]
["2035-10-12","sexta-feira","Nossa Sr.a Aparecida - Padroeira do Brasil"]
["2035-11-02","sexta-feira","Finados"]
["2035-11-15","quinta-feira","Proclamação da República"]
["2035-12-25","terça-feira","Natal"]
["2036-01-01","terça-feira","Confraternização Universal"]
["2036-02-25","segunda-feira","Carnaval"]
["2036-02-26","terça-feira","Carnaval"]
["2036-04-11","sexta-feira","Paixão de Cristo"]
["2036-04-21","segunda-feira","Tiradentes"]
["2036-05-01","quinta-feira","Dia do Trabalho"]
["2036-06-12","quinta-feira","Corpus Christi"]
["2036-09-07","domingo","Independência do Brasil"]
["2036-10-12","domingo","Nossa Sr.a Aparecida - Padroeira do Brasil"]
["2036-11-02","domingo","Finados"]
["2036-11-15","sábado","Proclamação da República"]
["2036-12-25","quinta-feira","Natal"]
["2037-01-01","quinta-feira","Confraternização Universal"]
["2037-02-16","segunda-feira","Carnaval"]
["2037-02-17","terça-feira","Carnaval"]
["2037-04-03","sexta-feira","Paixão de Cristo"]
["2037-04-21","terça-feira","Tiradentes"]
["2037-05-01","sexta-feira","Dia do Trabalho"]
["2037-06-04","quinta-feira","Corpus Christi"]
["2037-09-07","segunda-feira","Independência do Brasil"]
["2037-10-12","segunda-feira","Nossa Sr.a Aparecida - Padroeira do Brasil"]
["2037-11-02","segunda-feira","Finados"]
["2037-11-15","domingo","Proclamação da República"]
["2037-12-25","sexta-feira","Natal"]
["2038-01-01","sexta-feira","Confraternização Universal"]
["2038-03-08","segunda-feira","Carnaval"]
["2038-03-09","terça-feira","Carnaval"]
["2038-04-21","quarta-feira","Tiradentes"]
["2038-04-23","sexta-feira","Paixão de Cristo"]
["2038-05-01","sábado","Dia do Trabalho"]
["2038-06-24","quinta-feira","Corpus Christi"]
["2038-09-07","terça-feira","Independência do Brasil"]
["2038-10-12","terça-feira","Nossa Sr.a Aparecida - Padroeira do Brasil"]
["2038-11-02","terça-feira","Finados"]
["2038-11-15","segunda-feira","Proclamação da República"]
["2038-12-25","sábado","Natal"]
["2039-01-01","sábado","Confraternização Universal"]
["2039-02-21","segunda-feira","Carnaval"]
["2039-02-22","terça-feira","Carnaval"]
["2039-04-08","sexta-feira","Paixão de Cristo"]
["2039-04-21","quinta-feira","Tiradentes"]
["2039-05-01","domingo","Dia do Trabalho"]
["2039-06-09","quinta-feira","Corpus Christi"]
["2039-09-07","quarta-feira","Independência do Brasil"]
["2039-10-12","quarta-feira","Nossa Sr.a Aparecida - Padroeira do Brasil"]
["2039-11-02","quarta-feira","Finados"]
["2039-11-15","terça-feira","Proclamação da República"]
["2039-12-25","domingo","Natal"]
["2040-01-01","domingo","Confraternização Universal"]
["2040-02-13","segunda-feira","Carnaval"]
["2040-02-14","terça-feira","Carnaval"]
["2040-03-30","sexta-feira","Paixão de Cristo"]
["2040-04-21","sábado","Tiradentes"]
["2040-05-01","terça-feira","Dia do Trabalho"]
["2040-05-31","quinta-feira","Corpus Christi"]
["2040-09-07","sexta-feira","Independência do Brasil"]
["2040-10-12","sexta-feira","Nossa Sr.a Aparecida - Padroeira do Brasil"]
["2040-11-02","sexta-feira","Finados"]
["2040-11-15","quinta-feira","Proclamação da República"]
["2040-12-25","terça-feira","Natal"]
["2041-01-01","terça-feira","Confraternização Universal"]
["2041-03-04","segunda-feira","Carnaval"]
["2041-03-05","terça-feira","Carnaval"]
["2041-04-19","sexta-feira","Paixão de Cristo"]
["2041-04-21","domingo","Tiradentes"]
["2041-05-01","quarta-feira","Dia do Trabalho"]
["2041-06-20","quinta-feira","Corpus Christi"]
["2041-09-07","sábado","Independência do Brasil"]
["2041-10-12","sábado","Nossa Sr.a Aparecida - Padroeira do Brasil"]
["2041-11-02","sábado","Finados"]
["2041-11-15","sexta-feira","Proclamação da República"]
["2041-12-25","quarta-feira","Natal"]
["2042-01-01","quarta-feira","Confraternização Universal"]
["2042-02-17","segunda-feira","Carnaval"]
["2042-02-18","terça-feira","Carnaval"]
["2042-04-04","sexta-feira","Paixão de Cristo"]
["2042-04-21","segunda-feira","Tiradentes"]
["2042-05-01","quinta-feira","Dia do Trabalho"]
["2042-06-05","quinta-feira","Corpus Christi"]
["2042-09-07","domingo","Independência do Brasil"]
["2042-10-12","domingo","Nossa Sr.a Aparecida - Padroeira do Brasil"]
["2042-11-02","domingo","Finados"]
["2042-11-15","sábado","Proclamação da República"]
["2042-12-25","quinta-feira","Natal"]
["2043-01-01","quinta-feira","Confraternização Universal"]
["2043-02-09","segunda-feira","Carnaval"]
["2043-02-10","terça-feira","Carnaval"]
["2043-03-27","sexta-feira","Paixão de Cristo"]
["2043-04-21","terça-feira","Tiradentes"]
["2043-05-01","sexta-feira","Dia do Trabalho"]
["2043-05-28","quinta-feira","Corpus Christi"]
["2043-09-07","segunda-feira","Independência do Brasil"]
["2043-10-12","segunda-feira","Nossa Sr.a Aparecida - Padroeira do Brasil"]
["2043-11-02","segunda-feira","Finados"]
["2043-11-15","domingo","Proclamação da República"]
["2043-12-25","sexta-feira","Natal"]
["2044-01-01","sexta-feira","Confraternização Universal"]
["2044-02-29","segunda-feira","Carnaval"]
["2044-03-01","terça-feira","Carnaval"]
["2044-04-15","sexta-feira","Paixão de Cristo"]
["2044-04-21","quinta-feira","Tiradentes"]
["2044-05-01","domingo","Dia do Trabalho"]
["2044-06-16","quinta-feira","Corpus Christi"]
["2044-09-07","quarta-feira","Independência do Brasil"]
["2044-10-12","quarta-feira","Nossa Sr.a Aparecida - Padroeira do Brasil"]
["2044-11-02","quarta-feira","Finados"]
["2044-11-15","terça-feira","Proclamação da República"]
["2044-12-25","domingo","Natal"]
["2045-01-01","domingo","Confraternização Universal"]
["2045-02-20","segunda-feira","Carnaval"]
["2045-02-21","terça-feira","Carnaval"]
["2045-04-07","sexta-feira","Paixão de Cristo"]
["2045-04-21","sexta-feira","Tiradentes"]
["2045-05-01","segunda-feira","Dia do Trabalho"]
["2045-06-08","quinta-feira","Corpus Christi"]
["2045-09-07","quinta-feira","Independência do Brasil"]
["2045-10-12","quinta-feira","Nossa Sr.a Aparecida - Padroeira do Brasil"]
["2045-11-02","quinta-feira","Finados"]
["2045-11-15","quarta-feira","Proclamação da República"]
["2045-12-25","segunda-feira","Natal"]
["2046-01-01","segunda-feira","Confraternização Universal"]
["2046-02-05","segunda-feira","Carnaval"]
["2046-02-06","terça-feira","Carnaval"]
["2046-03-23","sexta-feira","Paixão de Cristo"]
["2046-04-21","sábado","Tiradentes"]
["2046-05-01","terça-feira","Dia do Trabalho"]
["2046-05-24","quinta-feira","Corpus Christi"]
["2046-09-07","sexta-feira","Independência do Brasil"]
["2046-10-12","sexta-feira","Nossa Sr.a Aparecida - Padroeira do Brasil"]
["2046-11-02","sexta-feira","Finados"]
["2046-11-15","quinta-feira","Proclamação da República"]
["2046-12-25","terça-feira","Natal"]
["2047-01-01","terça-feira","Confraternização Universal"]
["2047-02-25","segunda-feira","Carnaval"]
["2047-02-26","terça-feira","Carnaval"]
["2047-04-12","sexta-feira","Paixão de Cristo"]
["2047-04-21","terça-feira","Tiradentes"]
["2047-05-01","quarta-feira","Dia do Trabalho"]
["2047-06-13","quinta-feira","Corpus Christi"]
["2047-09-07","sábado","Independência do Brasil"]
["2047-10-12","sábado","Nossa Sr.a Aparecida - Padroeira do Brasil"]
["2047-11-02","sábado","Finados"]
["2047-11-15","sexta-feira","Proclamação da República"]
["2047-12-25","quarta-feira","Natal"]
["2048-01-01","quarta-feira","Confraternização Universal"]
["2048-02-17","segunda-feira","Carnaval"]
["2048-02-18","terça-feira","Carnaval"]
["2048-04-03","sexta-feira","Paixão de Cristo"]
["2048-04-21","terça-feira","Tiradentes"]
["2048-05-01","sexta-feira","Dia do Trabalho"]
["2048-06-04","quinta-feira","Corpus Christi"]
["2048-09-07","segunda-feira","Independência do Brasil"]
["2048-10-12","segunda-feira","Nossa Sr.a Aparecida - Padroeira do Brasil"]
["2048-11-02","segunda-feira","Finados"]
["2048-11-15","domingo","Proclamação da República"]
["2048-12-25","sexta-feira","Natal"]
["2049-01-01","sexta-feira","Confraternização Universal"]
["2049-03-01","segunda-feira","Carnaval"]
["2049-03-02","terça-feira","Carnaval"]
["2049-04-16","sexta-feira","Paixão de Cristo"]
["2049-04-21","quarta-feira","Tiradentes"]
["2049-05-01","sábado","Dia do Trabalho"]
["2049-06-17","quinta-feira","Corpus Christi"]
["2049-09-07","terça-feira","Independência do Brasil"]
["2049-10-12","terça-feira","Nossa Sr.a Aparecida - Padroeira do Brasil"]
["2049-11-02","terça-feira","Finados"]
["2049-11-15","segunda-feira","Proclamação da República"]
["2049-12-25","sábado","Natal"]
["2050-01-01","sábado","Confraternização Universal"]
["2050-02-21","segunda-feira","Carnaval"]
["2050-02-22","terça-feira","Carnaval"]
["2050-04-08","sexta-feira","Paixão de Cristo"]
["2050-04-21","quinta-feira","Tiradentes"]
["2050-05-01","domingo","Dia do Trabalho"]
["2050-06-09","quinta-feira","Corpus Christi"]
["2050-09-07","quarta-feira","Independência do Brasil"]
["2050-10-12","quarta-feira","Nossa Sr.a Aparecida - Padroeira do Brasil"]
["2050-11-02","quarta-feira","Finados"]
["2050-11-15","terça-feira","Proclamação da República"]
["2050-12-25","domingo","Natal"]
["2051-01-01","domingo","Confraternização Universal"]
["2051-02-13","segunda-feira","Carnaval"]
["2051-02-14","terça-feira","Carnaval"]
["2051-03-31","sexta-feira","Paixão de Cristo"]
["2051-04-21","sexta-feira","Tiradentes"]
["2051-05-01","segunda-feira","Dia do Trabalho"]
["2051-06-01","quinta-feira","Corpus Christi"]
["2051-09-07","quinta-feira","Independência do Brasil"]
["2051-10-12","quinta-feira","Nossa Sr.a Aparecida - Padroeira do Brasil"]
["2051-11-02","quinta-feira","Finados"]
["2051-11-15","quarta-feira","Proclamação da República"]
["2051-12-25","segunda-feira","Natal"]
["2052-01-01","segunda-feira","Confraternização Universal"]
["2052-03-04","segunda-feira","Carnaval"]
["2052-03-05","terça-feira","Carnaval"]
["2052-04-19","sexta-feira","Paixão de Cristo"]
["2052-04-21","domingo","Tiradentes"]
["2052-05-01","quarta-feira","Dia do Trabalho"]
["2052-06-20","quinta-feira","Corpus Christi"]
["2052-09-07","sábado","Independência do Brasil"]
["2052-10-12","sábado","Nossa Sr.a Aparecida - Padroeira do Brasil"]
["2052-11-02","sábado","Finados"]
["2052-11-15","sexta-feira","Proclamação da República"]
["2052-12-25","quarta-feira","Natal"]
["2053-01-01","quarta-feira","Confraternização Universal"]
["2053-02-17","segunda-feira","Carnaval"]
["2053-02-18","terça-feira","Carnaval"]
["2053-04-04","sexta-feira","Paixão de Cristo"]
["2053-04-21","segunda-feira","Tiradentes"]
["2053-05-01","quinta-feira","Dia do Trabalho"]
["2053-06-05","quinta-feira","Corpus Christi"]
["2053-09-07","domingo","Independência do Brasil"]
["2053-10-12","domingo","Nossa Sr.a Aparecida - Padroeira do Brasil"]
["2053-11-02","domingo","Finados"]
["2053-11-15","sábado","Proclamação da República"]
["2053-12-25","quinta-feira","Natal"]
["2054-01-01","quinta-feira","Confraternização Universal"]
["2054-02-09","segunda-feira","Carnaval"]
["2054-02-10","terça-feira","Carnaval"]
["2054-03-27","sexta-feira","Paixão de Cristo"]
["2054-04-21","terça-feira","Tiradentes"]
["2054-05-01","sexta-feira","Dia do Trabalho"]
["2054-05-28","quinta-feira","Corpus Christi"]
["2054-09-07","segunda-feira","Independência do Brasil"]
["2054-10-12","segunda-feira","Nossa Sr.a Aparecida - Padroeira do Brasil"]
["2054-11-02","segunda-feira","Finados"]
["2054-11-15","domingo","Proclamação da República"]
["2054-12-25","sexta-feira","Natal"]
["2055-01-01","sexta-feira","Confraternização Universal"]
["2055-03-01","segunda-feira","Carnaval"]
["2055-03-02","terça-feira","Carnaval"]
["2055-04-16","sexta-feira","Paixão de Cristo"]
["2055-04-21","quarta-feira","Tiradentes"]
["2055-05-01","sábado","Dia do Trabalho"]
["2055-06-17","quinta-feira","Corpus Christi"]
["2055-09-07","terça-feira","Independência do Brasil"]
["2055-10-12","terça-feira","Nossa Sr.a Aparecida - Padroeira do Brasil"]
["2055-11-02","terça-feira","Finados"]
["2055-11-15","segunda-feira","Proclamação da República"]
["2055-12-25","sábado","Natal"]
["2056-01-01","sábado","Confraternização Universal"]
["2056-02-14","segunda-feira","Carnaval"]
["2056-02-15","terça-feira","Carnaval"]
["2056-03-31","sexta-feira","Paixão de Cristo"]
["2056-04-21","sexta-feira","Tiradentes"]
["2056-05-01","segunda-feira","Dia do Trabalho"]
["2056-06-01","quinta-feira","Corpus Christi"]
["2056-09-07","quinta-feira","Independência do Brasil"]
["2056-10-12","quinta-feira","Nossa Sr.a Aparecida - Padroeira do Brasil"]
["2056-11-02","quinta-feira","Finados"]
["2056-11-15","quarta-feira","Proclamação da República"]
["2056-12-25","segunda-feira","Natal"]
["2057-01-01","segunda-feira","Confraternização Universal"]
["2057-03-05","segunda-feira","Carnaval"]
["2057-03-06","terça-feira","Carnaval"]
["2057-04-20","sexta-feira","Paixão de Cristo"]
["2057-04-21","sábado","Tiradentes"]
["2057-05-01","terça-feira","Dia do Trabalho"]
["2057-06-21","quinta-feira","Corpus Christi"]
["2057-09-07","sexta-feira","Independência do Brasil"]
["2057-10-12","sexta-feira","Nossa Sr.a Aparecida - Padroeira do Brasil"]
["2057-11-02","sexta-feira","Finados"]
["2057-11-15","quinta-feira","Proclamação da República"]
["2057-12-25","terça-feira","Natal"]
["2058-01-01","terça-feira","Confraternização Universal"]
["2058-02-25","segunda-feira","Carnaval"]
["2058-02-26","terça-feira","Carnaval"]
["2058-04-12","sexta-feira","Paixão de Cristo"]
["2058-04-21","domingo","Tiradentes"]
["2058-05-01","quarta-feira","Dia do Trabalho"]
["2058-06-13","quinta-feira","Corpus Christi"]
["2058-09-07","sábado","Independência do Brasil"]
["2058-10-12","sábado","Nossa Sr.a Aparecida - Padroeira do Brasil"]
["2058-11-02","sábado","Finados"]
["2058-11-15","sexta-feira","Proclamação da República"]
["2058-12-25","quarta-feira","Natal"]
["2059-01-01","quarta-feira","Confraternização Universal"]
["2059-02-10","segunda-feira","Carnaval"]
["2059-02-11","terça-feira","Carnaval"]
["2059-03-28","sexta-feira","Paixão de Cristo"]
["2059-04-21","segunda-feira","Tiradentes"]
["2059-05-01","quinta-feira","Dia do Trabalho"]
["2059-05-29","quinta-feira","Corpus Christi"]
["2059-09-07","domingo","Independência do Brasil"]
["2059-10-12","domingo","Nossa Sr.a Aparecida - Padroeira do Brasil"]
["2059-11-02","domingo","Finados"]
["2059-11-15","sábado","Proclamação da República"]
["2059-12-25","quinta-feira","Natal"]
["2060-01-01","quinta-feira","Confraternização Universal"]
["2060-03-01","segunda-feira","Carnaval"]
["2060-03-02","terça-feira","Carnaval"]
["2060-04-16","sexta-feira","Paixão de Cristo"]
["2060-04-21","quarta-feira","Tiradentes"]
["2060-05-01","sábado","Dia do Trabalho"]
["2060-06-17","quinta-feira","Corpus Christi"]
["2060-09-07","terça-feira","Independência do Brasil"]
["2060-10-12","terça-feira","Nossa Sr.a Aparecida - Padroeira do Brasil"]
["2060-11-02","terça-feira","Finados"]
["2060-11-15","segunda-feira","Proclamação da República"]
["2060-12-25","sábado","Natal"]
["2061-01-01","sábado","Confraternização Universal"]
["2061-02-21","segunda-feira","Carnaval"]
["2061-02-22","terça-feira","Carnaval"]
["2061-04-08","sexta-feira","Paixão de Cristo"]
["2061-04-21","quinta-feira","Tiradentes"]
["2061-05-01","domingo","Dia do Trabalho"]
["2061-06-09","quinta-feira","Corpus Christi"]
["2061-09-07","quarta-feira","Independência do Brasil"]
["2061-10-12","quarta-feira","Nossa Sr.a Aparecida - Padroeira do Brasil"]
["2061-11-02","quarta-feira","Finados"]
["2061-11-15","terça-feira","Proclamação da República"]
["2061-12-25","domingo","Natal"]
["2062-01-01","domingo","Confraternização Universal"]
["2062-02-06","segunda-feira","Carnaval"]
["2062-02-07","terça-feira","Carnaval"]
["2062-03-24","sexta-feira","Paixão de Cristo"]
["2062-04-21","sexta-feira","Tiradentes"]
["2062-05-01","segunda-feira","Dia do Trabalho"]
["2062-05-25","quinta-feira","Corpus Christi"]
["2062-09-07","quinta-feira","Independência do Brasil"]
["2062-10-12","quinta-feira","Nossa Sr.a Aparecida - Padroeira do Brasil"]
["2062-11-02","quinta-feira","Finados"]
["2062-11-15","quarta-feira","Proclamação da República"]
["2062-12-25","segunda-feira","Natal"]
["2063-01-01","segunda-feira","Confraternização Universal"]
["2063-02-26","segunda-feira","Carnaval"]
["2063-02-27","terça-feira","Carnaval"]
["2063-04-13","sexta-feira","Paixão de Cristo"]
["2063-04-21","sábado","Tiradentes"]
["2063-05-01","terça-feira","Dia do Trabalho"]
["2063-06-14","quinta-feira","Corpus Christi"]
["2063-09-07","sexta-feira","Independência do Brasil"]
["2063-10-12","sexta-feira","Nossa Sr.a Aparecida - Padroeira do Brasil"]
["2063-11-02","sexta-feira","Finados"]
["2063-11-15","quinta-feira","Proclamação da República"]
["2063-12-25","terça-feira","Natal"]
["2064-01-01","terça-feira","Confraternização Universal"]
["2064-02-18","segunda-feira","Carnaval"]
["2064-02-19","terça-feira","Carnaval"]
["2064-04-04","sexta-feira","Paixão de Cristo"]
["2064-04-21","segunda-feira","Tiradentes"]
["2064-05-01","quinta-feira","Dia do Trabalho"]
["2064-06-05","quinta-feira","Corpus Christi"]
["2064-09-07","domingo","Independência do Brasil"]
["2064-10-12","domingo","Nossa Sr.a Aparecida - Padroeira do Brasil"]
["2064-11-02","domingo","Finados"]
["2064-11-15","sábado","Proclamação da República"]
["2064-12-25","quinta-feira","Natal"]
["2065-01-01","quinta-feira","Confraternização Universal"]
["2065-02-09","segunda-feira","Carnaval"]
["2065-02-10","terça-feira","Carnaval"]
["2065-03-27","sexta-feira","Paixão de Cristo"]
["2065-04-21","terça-feira","Tiradentes"]
["2065-05-01","sexta-feira","Dia do Trabalho"]
["2065-05-28","quinta-feira","Corpus Christi"]
["2065-09-07","segunda-feira","Independência do Brasil"]
["2065-10-12","segunda-feira","Nossa Sr.a Aparecida - Padroeira do Brasil"]
["2065-11-02","segunda-feira","Finados"]
["2065-11-15","domingo","Proclamação da República"]
["2065-12-25","sexta-feira","Natal"]
["2066-01-01","sexta-feira","Confraternização Universal"]
["2066-02-22","segunda-feira","Carnaval"]
["2066-02-23","terça-feira","Carnaval"]
["2066-04-09","sexta-feira","Paixão de Cristo"]
["2066-04-21","quarta-feira","Tiradentes"]
["2066-05-01","sábado","Dia do Trabalho"]
["2066-06-10","quinta-feira","Corpus Christi"]
["2066-09-07","terça-feira","Independência do Brasil"]
["2066-10-12","terça-feira","Nossa Sr.a Aparecida - Padroeira do Brasil"]
["2066-11-02","terça-feira","Finados"]
["2066-11-15","segunda-feira","Proclamação da República"]
["2066-12-25","sábado","Natal"]
["2067-01-01","sábado","Confraternização Universal"]
["2067-02-14","segunda-feira","Carnaval"]
["2067-02-15","terça-feira","Carnaval"]
["2067-04-01","sexta-feira","Paixão de Cristo"]
["2067-04-21","quinta-feira","Tiradentes"]
["2067-05-01","domingo","Dia do Trabalho"]
["2067-06-02","quinta-feira","Corpus Christi"]
["2067-09-07","quarta-feira","Independência do Brasil"]
["2067-10-12","quarta-feira","Nossa Sr.a Aparecida - Padroeira do Brasil"]
["2067-11-02","quarta-feira","Finados"]
["2067-11-15","terça-feira","Proclamação da República"]
["2067-12-25","domingo","Natal"]
["2068-01-01","domingo","Confraternização Universal"]
["2068-03-05","segunda-feira","Carnaval"]
["2068-03-06","terça-feira","Carnaval"]
["2068-04-20","sexta-feira","Paixão de Cristo"]
["2068-04-21","sábado","Tiradentes"]
["2068-05-01","terça-feira","Dia do Trabalho"]
["2068-06-21","quinta-feira","Corpus Christi"]
["2068-09-07","sexta-feira","Independência do Brasil"]
["2068-10-12","sexta-feira","Nossa Sr.a Aparecida - Padroeira do Brasil"]
["2068-11-02","sexta-feira","Finados"]
["2068-11-15","quinta-feira","Proclamação da República"]
["2068-12-25","terça-feira","Natal"]
["2069-01-01","terça-feira","Confraternização Universal"]
["2069-02-25","segunda-feira","Carnaval"]
["2069-02-26","terça-feira","Carnaval"]
["2069-04-12","sexta-feira","Paixão de Cristo"]
["2069-04-21","domingo","Tiradentes"]
["2069-05-01","quarta-feira","Dia do Trabalho"]
["2069-06-13","quinta-feira","Corpus Christi"]
["2069-09-07","sábado","Independência do Brasil"]
["2069-10-12","sábado","Nossa Sr.a Aparecida - Padroeira do Brasil"]
["2069-11-02","sábado","Finados"]
["2069-11-15","sexta-feira","Proclamação da República"]
["2069-12-25","quarta-feira","Natal"]
["2070-01-01","quarta-feira","Confraternização Universal"]
["2070-02-10","segunda-feira","Carnaval"]
["2070-02-11","terça-feira","Carnaval"]
["2070-03-28","sexta-feira","Paixão de Cristo"]
["2070-04-21","segunda-feira","Tiradentes"]
["2070-05-01","quinta-feira","Dia do Trabalho"]
["2070-05-29","quinta-feira","Corpus Christi"]
["2070-09-07","domingo","Independência do Brasil"]
["2070-10-12","domingo","Nossa Sr.a Aparecida - Padroeira do Brasil"]
["2070-11-02","domingo","Finados"]
["2070-11-15","sábado","Proclamação da República"]
["2070-12-25","quinta-feira","Natal"]
["2071-01-01","quinta-feira","Confraternização Universal"]
["2071-03-02","segunda-feira","Carnaval"]
["2071-03-03","terça-feira","Carnaval"]
["2071-04-17","sexta-feira","Paixão de Cristo"]
["2071-04-21","terça-feira","Tiradentes"]
["2071-05-01","sexta-feira","Dia do Trabalho"]
["2071-06-18","quinta-feira","Corpus Christi"]
["2071-09-07","segunda-feira","Independência do Brasil"]
["2071-10-12","segunda-feira","Nossa Sr.a Aparecida - Padroeira do Brasil"]
["2071-11-02","segunda-feira","Finados"]
["2071-11-15","domingo","Proclamação da República"]
["2071-12-25","sexta-feira","Natal"]
["2072-01-01","sexta-feira","Confraternização Universal"]
["2072-02-22","segunda-feira","Carnaval"]
["2072-02-23","terça-feira","Carnaval"]
["2072-04-08","sexta-feira","Paixão de Cristo"]
["2072-04-21","quinta-feira","Tiradentes"]
["2072-05-01","domingo","Dia do Trabalho"]
["2072-06-09","quinta-feira","Corpus Christi"]
["2072-09-07","quarta-feira","Independência do Brasil"]
["2072-10-12","quarta-feira","Nossa Sr.a Aparecida - Padroeira do Brasil"]
["2072-11-02","quarta-feira","Finados"]
["2072-11-15","terça-feira","Proclamação da República"]
["2072-12-25","domingo","Natal"]
["2073-01-01","domingo","Confraternização Universal"]
["2073-02-06","segunda-feira","Carnaval"]
["2073-02-07","terça-feira","Carnaval"]
["2073-03-24","sexta-feira","Paixão de Cristo"]
["2073-04-21","sexta-feira","Tiradentes"]
["2073-05-01","segunda-feira","Dia do Trabalho"]
["2073-05-25","quinta-feira","Corpus Christi"]
["2073-09-07","quinta-feira","Independência do Brasil"]
["2073-10-12","quinta-feira","Nossa Sr.a Aparecida - Padroeira do Brasil"]
["2073-11-02","quinta-feira","Finados"]
["2073-11-15","quarta-feira","Proclamação da República"]
["2073-12-25","segunda-feira","Natal"]
["2074-01-01","segunda-feira","Confraternização Universal"]
["2074-02-26","segunda-feira","Carnaval"]
["2074-02-27","terça-feira","Carnaval"]
["2074-04-13","sexta-feira","Paixão de Cristo"]
["2074-04-21","sábado","Tiradentes"]
["2074-05-01","terça-feira","Dia do Trabalho"]
["2074-06-14","quinta-feira","Corpus Christi"]
["2074-09-07","sexta-feira","Independência do Brasil"]
["2074-10-12","sexta-feira","Nossa Sr.a Aparecida - Padroeira do Brasil"]
["2074-11-02","sexta-feira","Finados"]
["2074-11-15","quinta-feira","Proclamação da República"]
["2074-12-25","terça-feira","Natal"]
["2075-01-01","terça-feira","Confraternização Universal"]
["2075-02-18","segunda-feira","Carnaval"]
["2075-02-19","terça-feira","Carnaval"]
["2075-04-05","sexta-feira","Paixão de Cristo"]
["2075-04-21","domingo","Tiradentes"]
["2075-05-01","quarta-feira","Dia do Trabalho"]
["2075-06-06","quinta-feira","Corpus Christi"]
["2075-09-07","sábado","Independência do Brasil"]
["2075-10-12","sábado","Nossa Sr.a Aparecida - Padroeira do Brasil"]
["2075-11-02","sábado","Finados"]
["2075-11-15","sexta-feira","Proclamação da República"]
["2075-12-25","quarta-feira","Natal"]
["2076-01-01","quarta-feira","Confraternização Universal"]
["2076-03-02","segunda-feira","Carnaval"]
["2076-03-03","terça-feira","Carnaval"]
["2076-04-17","sexta-feira","Paixão de Cristo"]
["2076-04-21","terça-feira","Tiradentes"]
["2076-05-01","sexta-feira","Dia do Trabalho"]
["2076-06-18","quinta-feira","Corpus Christi"]
["2076-09-07","segunda-feira","Independência do Brasil"]
["2076-10-12","segunda-feira","Nossa Sr.a Aparecida - Padroeira do Brasil"]
["2076-11-02","segunda-feira","Finados"]
["2076-11-15","domingo","Proclamação da República"]
["2076-12-25","sexta-feira","Natal"]
["2077-01-01","sexta-feira","Confraternização Universal"]
["2077-02-22","segunda-feira","Carnaval"]
["2077-02-23","terça-feira","Carnaval"]
["2077-04-09","sexta-feira","Paixão de Cristo"]
["2077-04-21","quarta-feira","Tiradentes"]
["2077-05-01","sábado","Dia do Trabalho"]
["2077-06-10","quinta-feira","Corpus Christi"]
["2077-09-07","terça-feira","Independência do Brasil"]
["2077-10-12","terça-feira","Nossa Sr.a Aparecida - Padroeira do Brasil"]
["2077-11-02","terça-feira","Finados"]
["2077-11-15","segunda-feira","Proclamação da República"]
["2077-12-25","sábado","Natal"]
["2078-01-01","terça-feira","Confraternização Universal"]
["2078-02-14","segunda-feira","Carnaval"]
["2078-02-15","terça-feira","Carnaval"]
["2078-04-01","sexta-feira","Paixão de Cristo"]
["2078-04-21","quinta-feira","Tiradentes"]
["2078-05-01","quarta-feira","Dia do Trabalho"]
["2078-06-02","quinta-feira","Corpus Christi"]
["2078-09-07","quarta-feira","Independência do Brasil"]
["2078-10-12","quarta-feira","Nossa Sr.a Aparecida - Padroeira do Brasil"]
["2078-11-02","quarta-feira","Finados"]
["2078-11-15","terça-feira","Proclamação da República"]
["2078-12-25","quarta-feira","Natal"]
["Fonte: ANBIMA"]