{"text_format":"1","workbook":"xlsx","n_sheets":7,"sheets":["Resumo","Contratos em Aberto DI","Curva de Juros Pré","ETTJ x Contratos em Aberto","Anbima LTN","Legendas","Feriados"],"not_rendered":{"charts":4,"images":1,"macros":1,"external_links":0,"defined_names":0,"comments":0,"pivot_tables":0},"unopened":[],"bounds":{"document_bytes":16777216,"sheet_cells":100000,"rows_first":2000,"rows_last":500,"rows_between":2000,"halvings":0,"cell_chars":16384,"cell_head_chars":4096},"cells_cut":0,"cells_raw":0,"read":"whole","date_system":"1900"}

{"sheet":"Resumo","index":0,"n_rows":41,"n_cols":10,"rows_kept":41,"cut":false,"hidden":false,"merged":[]}
[]
[null,"Série","Mês","Data","Preços","Dias","Taxa","Contratos","Variação","DV01"]
[null,null,"Vencimento","Vencimento","Futuros","Úteis","Pré","em Aberto","Quantidade"]
[null,{"$f":"'Contratos em Aberto DI'!A2","v":"Q22"},{"$f":"VLOOKUP(MID(B4,1,1),Legendas!$B$8:$D$19,2,FALSE)","v":"Agosto"},{"$f":"WORKDAY(EOMONTH(\"15/\"&VLOOKUP(MID(B4,1,1),Legendas!$B$8:$D$19,3,FALSE)&\"/\"&\"20\"&RIGHT(B4,2),-1),1,Feriados!$A$2:$A$937)","v":"2022-08-01"},{"$f":"100000/(1+G4)^(F4/252)","v":99706.279381506698},{"$f":"NETWORKDAYS('Curva de Juros Pré'!$B$1,D4,Feriados!$A$2:$A$937)-1","v":6},{"$f":"InterpolaPre(F4)","v":0.13149999999999706},{"$f":"VLOOKUP(B4,'Contratos em Aberto DI'!$A$2:$C$40,2,FALSE)","v":742547},{"$f":"VLOOKUP(B4,'Contratos em Aberto DI'!$A$2:$C$40,3,FALSE)","v":0},{"$f":"100000/(1+G4+0.01%)^(F4/252)-100000/(1+G4)^(F4/252)","v":-0.20979687481303699}]
[null,{"$f":"'Contratos em Aberto DI'!A3","v":"U22"},{"$f":"VLOOKUP(MID(B5,1,1),Legendas!$B$8:$D$19,2,FALSE)","v":"Setembro"},{"$f":"WORKDAY(EOMONTH(\"15/\"&VLOOKUP(MID(B5,1,1),Legendas!$B$8:$D$19,3,FALSE)&\"/\"&\"20\"&RIGHT(B5,2),-1),1,Feriados!$A$2:$A$937)","v":"2022-09-01"},{"$f":"100000/(1+G5)^(F5/252)","v":98555.285123036432},{"$f":"NETWORKDAYS('Curva de Juros Pré'!$B$1,D5,Feriados!$A$2:$A$937)-1","v":29},{"$f":"InterpolaPre(F5)","v":0.13479999999999936},{"$f":"VLOOKUP(B5,'Contratos em Aberto DI'!$A$2:$C$40,2,FALSE)","v":518765},{"$f":"VLOOKUP(B5,'Contratos em Aberto DI'!$A$2:$C$40,3,FALSE)","v":0},{"$f":"100000/(1+G5+0.01%)^(F5/252)-100000/(1+G5)^(F5/252)","v":-0.99939394101966172}]
[null,{"$f":"'Contratos em Aberto DI'!A4","v":"V22"},{"$f":"VLOOKUP(MID(B6,1,1),Legendas!$B$8:$D$19,2,FALSE)","v":"Outubro"},{"$f":"WORKDAY(EOMONTH(\"15/\"&VLOOKUP(MID(B6,1,1),Legendas!$B$8:$D$19,3,FALSE)&\"/\"&\"20\"&RIGHT(B6,2),-1),1,Feriados!$A$2:$A$937)","v":"2022-10-03"},97503.413797579095,{"$f":"NETWORKDAYS('Curva de Juros Pré'!$B$1,D6,Feriados!$A$2:$A$937)-1","v":50},{"$f":"InterpolaPre(F6)","v":0.13590000000000013},{"$f":"VLOOKUP(B6,'Contratos em Aberto DI'!$A$2:$C$40,2,FALSE)","v":2231457},{"$f":"VLOOKUP(B6,'Contratos em Aberto DI'!$A$2:$C$40,3,FALSE)","v":0},-1.7030456001666607]
[null,{"$f":"'Contratos em Aberto DI'!A5","v":"X22"},{"$f":"VLOOKUP(MID(B7,1,1),Legendas!$B$8:$D$19,2,FALSE)","v":"Novembro"},{"$f":"WORKDAY(EOMONTH(\"15/\"&VLOOKUP(MID(B7,1,1),Legendas!$B$8:$D$19,3,FALSE)&\"/\"&\"20\"&RIGHT(B7,2),-1),1,Feriados!$A$2:$A$937)","v":"2022-11-01"},96494.013911824019,{"$f":"NETWORKDAYS('Curva de Juros Pré'!$B$1,D7,Feriados!$A$2:$A$937)-1","v":70},{"$f":"InterpolaPre(F7)","v":0.1371},{"$f":"VLOOKUP(B7,'Contratos em Aberto DI'!$A$2:$C$40,2,FALSE)","v":325915},{"$f":"VLOOKUP(B7,'Contratos em Aberto DI'!$A$2:$C$40,3,FALSE)","v":0},-2.3570826537034009]
[null,{"$f":"'Contratos em Aberto DI'!A6","v":"Z22"},{"$f":"VLOOKUP(MID(B8,1,1),Legendas!$B$8:$D$19,2,FALSE)","v":"Dezembro"},{"$f":"WORKDAY(EOMONTH(\"15/\"&VLOOKUP(MID(B8,1,1),Legendas!$B$8:$D$19,3,FALSE)&\"/\"&\"20\"&RIGHT(B8,2),-1),1,Feriados!$A$2:$A$937)","v":"2022-12-01"},95488.086848661813,{"$f":"NETWORKDAYS('Curva de Juros Pré'!$B$1,D8,Feriados!$A$2:$A$937)-1","v":90},{"$f":"InterpolaPre(F8)","v":0.1379999999999999},{"$f":"VLOOKUP(B8,'Contratos em Aberto DI'!$A$2:$C$40,2,FALSE)","v":264213},{"$f":"VLOOKUP(B8,'Contratos em Aberto DI'!$A$2:$C$40,3,FALSE)","v":0},-2.9965601756848628]
[null,{"$f":"'Contratos em Aberto DI'!A7","v":"F23"},{"$f":"VLOOKUP(MID(B9,1,1),Legendas!$B$8:$D$19,2,FALSE)","v":"Janeiro"},{"$f":"WORKDAY(EOMONTH(\"15/\"&VLOOKUP(MID(B9,1,1),Legendas!$B$8:$D$19,3,FALSE)&\"/\"&\"20\"&RIGHT(B9,2),-1),1,Feriados!$A$2:$A$937)","v":"2023-01-02"},94394.380906448379,{"$f":"NETWORKDAYS('Curva de Juros Pré'!$B$1,D9,Feriados!$A$2:$A$937)-1","v":112},{"$f":"InterpolaPre(F9)","v":0.13859999999999983},{"$f":"VLOOKUP(B9,'Contratos em Aberto DI'!$A$2:$C$40,2,FALSE)","v":5413628},{"$f":"VLOOKUP(B9,'Contratos em Aberto DI'!$A$2:$C$40,3,FALSE)","v":0},-3.6843840908259153]
[null,{"$f":"'Contratos em Aberto DI'!A8","v":"G23"},{"$f":"VLOOKUP(MID(B10,1,1),Legendas!$B$8:$D$19,2,FALSE)","v":"Fevereiro"},{"$f":"WORKDAY(EOMONTH(\"15/\"&VLOOKUP(MID(B10,1,1),Legendas!$B$8:$D$19,3,FALSE)&\"/\"&\"20\"&RIGHT(B10,2),-1),1,Feriados!$A$2:$A$937)","v":"2023-02-01"},93313.339881165957,{"$f":"NETWORKDAYS('Curva de Juros Pré'!$B$1,D10,Feriados!$A$2:$A$937)-1","v":134},{"$f":"InterpolaPre(F10)","v":0.13900000000000001},{"$f":"VLOOKUP(B10,'Contratos em Aberto DI'!$A$2:$C$40,2,FALSE)","v":74540},{"$f":"VLOOKUP(B10,'Contratos em Aberto DI'!$A$2:$C$40,3,FALSE)","v":0},-4.356072169932304]
[null,{"$f":"'Contratos em Aberto DI'!A9","v":"H23"},{"$f":"VLOOKUP(MID(B11,1,1),Legendas!$B$8:$D$19,2,FALSE)","v":"Março"},{"$f":"WORKDAY(EOMONTH(\"15/\"&VLOOKUP(MID(B11,1,1),Legendas!$B$8:$D$19,3,FALSE)&\"/\"&\"20\"&RIGHT(B11,2),-1),1,Feriados!$A$2:$A$937)","v":"2023-03-01"},92444.978854987319,{"$f":"NETWORKDAYS('Curva de Juros Pré'!$B$1,D11,Feriados!$A$2:$A$937)-1","v":152},{"$f":"InterpolaPre(F11)","v":0.1391},{"$f":"VLOOKUP(B11,'Contratos em Aberto DI'!$A$2:$C$40,2,FALSE)","v":75897},{"$f":"VLOOKUP(B11,'Contratos em Aberto DI'!$A$2:$C$40,3,FALSE)","v":0},-4.8947888559778221]
[null,{"$f":"'Contratos em Aberto DI'!A10","v":"J23"},{"$f":"VLOOKUP(MID(B12,1,1),Legendas!$B$8:$D$19,2,FALSE)","v":"Abril"},{"$f":"WORKDAY(EOMONTH(\"15/\"&VLOOKUP(MID(B12,1,1),Legendas!$B$8:$D$19,3,FALSE)&\"/\"&\"20\"&RIGHT(B12,2),-1),1,Feriados!$A$2:$A$937)","v":"2023-04-03"},91313.640557849023,{"$f":"NETWORKDAYS('Curva de Juros Pré'!$B$1,D12,Feriados!$A$2:$A$937)-1","v":175},{"$f":"InterpolaPre(F12)","v":0.13979999999999992},{"$f":"VLOOKUP(B12,'Contratos em Aberto DI'!$A$2:$C$40,2,FALSE)","v":630865},{"$f":"VLOOKUP(B12,'Contratos em Aberto DI'!$A$2:$C$40,3,FALSE)","v":0},-5.5630406454438344]
[null,{"$f":"'Contratos em Aberto DI'!A11","v":"K23"},{"$f":"VLOOKUP(MID(B13,1,1),Legendas!$B$8:$D$19,2,FALSE)","v":"Maio"},{"$f":"WORKDAY(EOMONTH(\"15/\"&VLOOKUP(MID(B13,1,1),Legendas!$B$8:$D$19,3,FALSE)&\"/\"&\"20\"&RIGHT(B13,2),-1),1,Feriados!$A$2:$A$937)","v":"2023-05-02"},90458.063836124551,{"$f":"NETWORKDAYS('Curva de Juros Pré'!$B$1,D13,Feriados!$A$2:$A$937)-1","v":193},{"$f":"InterpolaPre(F13)","v":0.13989999999999991},{"$f":"VLOOKUP(B13,'Contratos em Aberto DI'!$A$2:$C$40,2,FALSE)","v":29478},{"$f":"VLOOKUP(B13,'Contratos em Aberto DI'!$A$2:$C$40,3,FALSE)","v":0},-6.0772018944844604]
[null,{"$f":"'Contratos em Aberto DI'!A12","v":"M23"},{"$f":"VLOOKUP(MID(B14,1,1),Legendas!$B$8:$D$19,2,FALSE)","v":"Junho"},{"$f":"WORKDAY(EOMONTH(\"15/\"&VLOOKUP(MID(B14,1,1),Legendas!$B$8:$D$19,3,FALSE)&\"/\"&\"20\"&RIGHT(B14,2),-1),1,Feriados!$A$2:$A$937)","v":"2023-06-01"},89423.203922256886,{"$f":"NETWORKDAYS('Curva de Juros Pré'!$B$1,D14,Feriados!$A$2:$A$937)-1","v":215},{"$f":"InterpolaPre(F14)","v":0.14000000000000012},{"$f":"VLOOKUP(B14,'Contratos em Aberto DI'!$A$2:$C$40,2,FALSE)","v":30150},{"$f":"VLOOKUP(B14,'Contratos em Aberto DI'!$A$2:$C$40,3,FALSE)","v":0},-6.6918777127430076]
[null,{"$f":"'Contratos em Aberto DI'!A13","v":"N23"},{"$f":"VLOOKUP(MID(B15,1,1),Legendas!$B$8:$D$19,2,FALSE)","v":"Julho"},{"$f":"WORKDAY(EOMONTH(\"15/\"&VLOOKUP(MID(B15,1,1),Legendas!$B$8:$D$19,3,FALSE)&\"/\"&\"20\"&RIGHT(B15,2),-1),1,Feriados!$A$2:$A$937)","v":"2023-07-03"},88437.571216330616,{"$f":"NETWORKDAYS('Curva de Juros Pré'!$B$1,D15,Feriados!$A$2:$A$937)-1","v":236},{"$f":"InterpolaPre(F15)","v":0.1402000000000001},{"$f":"VLOOKUP(B15,'Contratos em Aberto DI'!$A$2:$C$40,2,FALSE)","v":2172565},{"$f":"VLOOKUP(B15,'Contratos em Aberto DI'!$A$2:$C$40,3,FALSE)","v":0},-7.2632393155217869]
{"$rows_left_out":27}
{"sheet":"Contratos em Aberto DI","index":1,"n_rows":39,"n_cols":7,"rows_kept":39,"cut":false,"hidden":false,"merged":[[0,0,0,2]]}
[]
["Q22",742547,0,null,null,"Site:","https://www.b3.com.br/pt_br/market-data-e-indices/servicos-de-dados/market-data/consultas/mercado-de-derivativos/contratos-em-aberto/vencimento-serie/contratos-em-aberto-futuro/"]
["U22",518765,0]
["V22",2231457,0]
["X22",325915,0]
["Z22",264213,0]
["F23",5413628,0]
["G23",74540,0]
["H23",75897,0]
["J23",630865,0]
["K23",29478,0]
["M23",30150,0]
["N23",2172565,0]
["V23",309489,0]
["F24",3745488,0]
{"$rows_left_out":25}
{"sheet":"Curva de Juros Pré","index":2,"n_rows":268,"n_cols":3,"rows_kept":268,"cut":false,"hidden":false,"merged":[]}
["Data",{"$f":"'Anbima LTN'!K1","v":"2022-07-22"},"https://www.b3.com.br/pt_br/market-data-e-indices/servicos-de-dados/market-data/consultas/mercado-de-derivativos/precos-referenciais/taxas-referenciais-bm-fbovespa/"]
[]
["DC","DU","ETTJ Pré"]
[3,{"$f":"NETWORKDAYS($B$1,$B$1+A4,Feriados!$A$2:$A$937)-1","v":1},0.13150000000000001]
[6,{"$f":"NETWORKDAYS($B$1,$B$1+A5,Feriados!$A$2:$A$937)-1","v":4},0.13150000000000001]
[7,{"$f":"NETWORKDAYS($B$1,$B$1+A6,Feriados!$A$2:$A$937)-1","v":5},0.13150000000000001]
[10,{"$f":"NETWORKDAYS($B$1,$B$1+A7,Feriados!$A$2:$A$937)-1","v":6},0.13150000000000001]
[14,{"$f":"NETWORKDAYS($B$1,$B$1+A8,Feriados!$A$2:$A$937)-1","v":10},0.13320000000000001]
[21,{"$f":"NETWORKDAYS($B$1,$B$1+A9,Feriados!$A$2:$A$937)-1","v":15},0.13400000000000001]
[24,{"$f":"NETWORKDAYS($B$1,$B$1+A10,Feriados!$A$2:$A$937)-1","v":16},0.1341]
[26,{"$f":"NETWORKDAYS($B$1,$B$1+A11,Feriados!$A$2:$A$937)-1","v":18},0.1343]
[28,{"$f":"NETWORKDAYS($B$1,$B$1+A12,Feriados!$A$2:$A$937)-1","v":20},0.13439999999999999]
[31,{"$f":"NETWORKDAYS($B$1,$B$1+A13,Feriados!$A$2:$A$937)-1","v":21},0.13449999999999998]
[33,{"$f":"NETWORKDAYS($B$1,$B$1+A14,Feriados!$A$2:$A$937)-1","v":23},0.1346]
[39,{"$f":"NETWORKDAYS($B$1,$B$1+A15,Feriados!$A$2:$A$937)-1","v":27},0.13470000000000001]
{"$rows_left_out":254}
{"sheet":"ETTJ x Contratos em Aberto","index":3,"n_rows":40,"n_cols":23,"rows_kept":40,"cut":false,"hidden":false,"merged":[]}
[]
[null,null,null,null,null,null,null,null,null,null,null,"Min. Liquidez Desejada",null,1500000,null,null,"Vencimento","Série","Taxa","Contratos","DV01",null,0]
[null,null,null,null,null,null,null,null,null,null,null,null,null,null,null,null,{"$f":"Resumo!D4","v":"2022-08-01"},{"$f":"Resumo!B4","v":"Q22"},{"$f":"Resumo!G4","v":0.13149999999999706},{"$f":"IF(Resumo!H4>'ETTJ x Contratos em Aberto'!$N$2,Resumo!H4,NA())","v":{"$error":"#N/A"}},{"$f":"IF(Resumo!H4>'ETTJ x Contratos em Aberto'!$N$2,Resumo!J4,NA())","v":{"$error":"#N/A"}},null,500000]
[null,null,null,null,null,null,null,null,null,null,null,null,null,null,null,null,{"$f":"Resumo!D5","v":"2022-09-01"},{"$f":"Resumo!B5","v":"U22"},{"$f":"Resumo!G5","v":0.13479999999999936},{"$f":"IF(Resumo!H5>'ETTJ x Contratos em Aberto'!$N$2,Resumo!H5,NA())","v":{"$error":"#N/A"}},{"$f":"IF(Resumo!H5>'ETTJ x Contratos em Aberto'!$N$2,Resumo!J5,NA())","v":{"$error":"#N/A"}},null,1000000]
[null,null,null,null,null,null,null,null,null,null,null,null,null,null,null,null,{"$f":"Resumo!D6","v":"2022-10-03"},{"$f":"Resumo!B6","v":"V22"},{"$f":"Resumo!G6","v":0.13590000000000013},{"$f":"IF(Resumo!H6>'ETTJ x Contratos em Aberto'!$N$2,Resumo!H6,NA())","v":2231457},{"$f":"IF(Resumo!H6>'ETTJ x Contratos em Aberto'!$N$2,Resumo!J6,NA())","v":-1.7030456001666607},null,1500000]
[null,null,null,null,null,null,null,null,null,null,null,null,null,null,null,null,{"$f":"Resumo!D7","v":"2022-11-01"},{"$f":"Resumo!B7","v":"X22"},{"$f":"Resumo!G7","v":0.1371},{"$f":"IF(Resumo!H7>'ETTJ x Contratos em Aberto'!$N$2,Resumo!H7,NA())","v":{"$error":"#N/A"}},{"$f":"IF(Resumo!H7>'ETTJ x Contratos em Aberto'!$N$2,Resumo!J7,NA())","v":{"$error":"#N/A"}},null,2000000]
[null,null,null,null,null,null,null,null,null,null,null,null,null,null,null,null,{"$f":"Resumo!D8","v":"2022-12-01"},{"$f":"Resumo!B8","v":"Z22"},{"$f":"Resumo!G8","v":0.1379999999999999},{"$f":"IF(Resumo!H8>'ETTJ x Contratos em Aberto'!$N$2,Resumo!H8,NA())","v":{"$error":"#N/A"}},{"$f":"IF(Resumo!H8>'ETTJ x Contratos em Aberto'!$N$2,Resumo!J8,NA())","v":{"$error":"#N/A"}},null,3000000]
[null,null,null,null,null,null,null,null,null,null,null,null,null,null,null,null,{"$f":"Resumo!D9","v":"2023-01-02"},{"$f":"Resumo!B9","v":"F23"},{"$f":"Resumo!G9","v":0.13859999999999983},{"$f":"IF(Resumo!H9>'ETTJ x Contratos em Aberto'!$N$2,Resumo!H9,NA())","v":5413628},{"$f":"IF(Resumo!H9>'ETTJ x Contratos em Aberto'!$N$2,Resumo!J9,NA())","v":-3.6843840908259153}]
[null,null,null,null,null,null,null,null,null,null,null,null,null,null,null,null,{"$f":"Resumo!D10","v":"2023-02-01"},{"$f":"Resumo!B10","v":"G23"},{"$f":"Resumo!G10","v":0.13900000000000001},{"$f":"IF(Resumo!H10>'ETTJ x Contratos em Aberto'!$N$2,Resumo!H10,NA())","v":{"$error":"#N/A"}},{"$f":"IF(Resumo!H10>'ETTJ x Contratos em Aberto'!$N$2,Resumo!J10,NA())","v":{"$error":"#N/A"}}]
[null,null,null,null,null,null,null,null,null,null,null,null,null,null,null,null,{"$f":"Resumo!D11","v":"2023-03-01"},{"$f":"Resumo!B11","v":"H23"},{"$f":"Resumo!G11","v":0.1391},{"$f":"IF(Resumo!H11>'ETTJ x Contratos em Aberto'!$N$2,Resumo!H11,NA())","v":{"$error":"#N/A"}},{"$f":"IF(Resumo!H11>'ETTJ x Contratos em Aberto'!$N$2,Resumo!J11,NA())","v":{"$error":"#N/A"}}]
[null,null,null,null,null,null,null,null,null,null,null,null,null,null,null,null,{"$f":"Resumo!D12","v":"2023-04-03"},{"$f":"Resumo!B12","v":"J23"},{"$f":"Resumo!G12","v":0.13979999999999992},{"$f":"IF(Resumo!H12>'ETTJ x Contratos em Aberto'!$N$2,Resumo!H12,NA())","v":{"$error":"#N/A"}},{"$f":"IF(Resumo!H12>'ETTJ x Contratos em Aberto'!$N$2,Resumo!J12,NA())","v":{"$error":"#N/A"}}]
[null,null,null,null,null,null,null,null,null,null,null,null,null,null,null,null,{"$f":"Resumo!D13","v":"2023-05-02"},{"$f":"Resumo!B13","v":"K23"},{"$f":"Resumo!G13","v":0.13989999999999991},{"$f":"IF(Resumo!H13>'ETTJ x Contratos em Aberto'!$N$2,Resumo!H13,NA())","v":{"$error":"#N/A"}},{"$f":"IF(Resumo!H13>'ETTJ x Contratos em Aberto'!$N$2,Resumo!J13,NA())","v":{"$error":"#N/A"}}]
[null,null,null,null,null,null,null,null,null,null,null,null,null,null,null,null,{"$f":"Resumo!D14","v":"2023-06-01"},{"$f":"Resumo!B14","v":"M23"},{"$f":"Resumo!G14","v":0.14000000000000012},{"$f":"IF(Resumo!H14>'ETTJ x Contratos em Aberto'!$N$2,Resumo!H14,NA())","v":{"$error":"#N/A"}},{"$f":"IF(Resumo!H14>'ETTJ x Contratos em Aberto'!$N$2,Resumo!J14,NA())","v":{"$error":"#N/A"}}]
[null,null,null,null,null,null,null,null,null,null,null,null,null,null,null,null,{"$f":"Resumo!D15","v":"2023-07-03"},{"$f":"Resumo!B15","v":"N23"},{"$f":"Resumo!G15","v":0.1402000000000001},{"$f":"IF(Resumo!H15>'ETTJ x Contratos em Aberto'!$N$2,Resumo!H15,NA())","v":2172565},{"$f":"IF(Resumo!H15>'ETTJ x Contratos em Aberto'!$N$2,Resumo!J15,NA())","v":-7.2632393155217869}]
[null,null,null,null,null,null,null,null,null,null,null,null,null,null,null,null,{"$f":"Resumo!D16","v":"2023-10-02"},{"$f":"Resumo!B16","v":"V23"},{"$f":"Resumo!G16","v":0.13939999999999997},{"$f":"IF(Resumo!H16>'ETTJ x Contratos em Aberto'!$N$2,Resumo!H16,NA())","v":{"$error":"#N/A"}},{"$f":"IF(Resumo!H16>'ETTJ x Contratos em Aberto'!$N$2,Resumo!J16,NA())","v":{"$error":"#N/A"}}]
{"$rows_left_out":26}
{"sheet":"Anbima LTN","index":4,"n_rows":19,"n_cols":35,"rows_kept":19,"cut":false,"hidden":false,"merged":[[3,6,4,6],[3,7,3,10],[0,0,0,9],[1,0,1,10],[2,0,2,1],[2,2,2,10],[3,0,4,0],[3,1,4,1],[3,2,4,2],[3,3,4,3],[3,4,4,4],[3,5,4,5]]}
["Títulos Públicos Federais",null,null,null,null,null,null,null,null,null,"2022-07-22"]
[null,null,null,null,null,null,null,null,null,null,null,null,null,null,null,null,null,null,null,null,null,null,null,null,null,null,null,null,null,"Escolha do Papel",null,null,"Preço=f(i)"]
["Papel PREFIXADO",null,"LTN - Taxa (% a.a.)/252",null,null,null,null,null,null,null,null,null,null,null,null,null,null,null,null,null,null,null,null,null,null,null,null,null,null,"LTN","2026-01-01",null,"i (% a.a.)","Preço"]
["Código SELIC","Data Base/Emissão","Data de Vencimento","Tx. Compra","Tx. Venda","Tx. Indicativas","PU","Intervalo Indicativo",null,null,null,null,"Vencimento","Liquidação","Dias","Taxa Pré LTN","Preço","Taxa Pré B3","Spread",null,null,null,null,null,null,null,null,null,null,"Vencimento",{"$f":"VLOOKUP(AE3,$M$6:$S$17,2,FALSE)","v":"2026-01-02"},null,{"$f":"AG5-1%","v":5.319400000000004E-2},{"$f":"1000/(1+AG4)^($AE$5/252)","v":836.51002172907477}]
[null,null,null,null,null,null,null,"Mínimo (D0)","Máximo (D0)","Mínimo (D+1)","Máximo (D+1)",null,null,null,"Úteis","(% a.a.)",null,"(% a.a.)","(% a.a.)",null,null,null,null,null,null,null,null,null,null,"Prazo (DU)",{"$f":"VLOOKUP(AE3,$M$6:$S$17,3,FALSE)","v":868},null,6.3194000000000042E-2,{"$f":"1000/(1+AG5)^($AE$5/252)","v":809.71962158511337}]
[100000,"2020-07-03","2022-10-01",13.622299999999999,13.6027,13.612500000000001,974.99582099999998,13.484500000000001,13.9483,13.488099999999999,13.9511,null,{"$f":"C6","v":"2022-10-01"},{"$f":"WORKDAY(M6-1,1,Feriados!$A$2:$A$937)","v":"2022-10-03"},{"$f":"NETWORKDAYS($K$1,N6,Feriados!$A$2:$A$937)-1","v":50},{"$f":"F6/100","v":0.136125},{"$f":"1000/(1+P6)^(O6/252)","v":974.99582197609925},{"$f":"InterpolaPre(O6)","v":0.13590000000000013},{"$f":"(1+P6)/(1+R6)-1","v":1.9808081697325619E-4},null,null,null,null,null,null,null,null,null,null,"Taxa (% a.a.)",{"$f":"VLOOKUP(AE3,$M$6:$S$17,4,FALSE)","v":0.13319400000000001},null,7.3194000000000037E-2,784.02610022789383]
[100000,"2016-01-20","2023-01-01",13.886699999999999,13.8687,13.878,943.87749299999996,13.7529,14.377599999999999,13.7111,14.3307,null,{"$f":"C7","v":"2023-01-01"},{"$f":"WORKDAY(M7-1,1,Feriados!$A$2:$A$937)","v":"2023-01-02"},{"$f":"NETWORKDAYS($K$1,N7,Feriados!$A$2:$A$937)-1","v":112},{"$f":"F7/100","v":0.13878000000000001},{"$f":"1000/(1+P7)^(O7/252)","v":943.87749351571324},{"$f":"InterpolaPre(O7)","v":0.13859999999999983},{"$f":"(1+P7)/(1+R7)-1","v":1.580888810823744E-4},null,null,null,null,null,null,null,null,null,null,"Preço Unitário",{"$f":"1000/(1+AE6)^(AE5/252)","v":650.05779652662898},null,8.3194000000000032E-2,759.37494663654081]
[100000,"2022-01-07","2023-04-01",14.0055,13.9842,13.995699999999999,913.04906900000003,13.856999999999999,14.6191,13.768000000000001,14.5291,null,"2023-04-01",{"$f":"WORKDAY(M8-1,1,Feriados!$A$2:$A$937)","v":"2023-04-03"},{"$f":"NETWORKDAYS($K$1,N8,Feriados!$A$2:$A$937)-1","v":175},0.139957,913.04906954033993,{"$f":"InterpolaPre(O8)","v":0.13979999999999992},1.3774346376549396E-4,null,null,null,null,null,null,null,null,null,null,"Taxa B3 (% a.a.)",{"$f":"VLOOKUP(AE3,$M$6:$S$17,6,FALSE)","v":0.13179999999999992},null,9.3194000000000027E-2,735.71482731130902]
[100000,"2019-04-05","2023-07-01",14.0557,14.0435,14.05,884.15785100000005,13.925599999999999,14.7469,13.801,14.621600000000001,null,"2023-07-01",{"$f":"WORKDAY(M9-1,1,Feriados!$A$2:$A$937)","v":"2023-07-03"},{"$f":"NETWORKDAYS($K$1,N9,Feriados!$A$2:$A$937)-1","v":236},0.14050000000000001,884.15785198178617,{"$f":"InterpolaPre(O9)","v":0.1402000000000001},2.6311173478332783E-4,null,null,null,null,null,null,null,null,null,null,"Spread (% a.a.)",{"$f":"VLOOKUP(AE3,$M$6:$S$17,7,FALSE)","v":1.2316663721505527E-3},null,0.10319400000000002,712.9973742316979]
[100000,"2022-07-08","2023-10-01",13.981400000000001,13.966900000000001,13.975,855.79456200000004,13.8589,14.733499999999999,13.6989,14.573399999999999,null,"2023-10-01",{"$f":"WORKDAY(M10-1,1,Feriados!$A$2:$A$937)","v":"2023-10-02"},{"$f":"NETWORKDAYS($K$1,N10,Feriados!$A$2:$A$937)-1","v":300},0.13974999999999999,855.79456251684019,{"$f":"InterpolaPre(O10)","v":0.13939999999999997},3.0717921713185881E-4,null,null,null,null,null,null,null,null,null,null,"DV01",{"$f":"1000/(1+AE6+0.01%)^(AE5/252)-1000/(1+AE6)^(AE5/252)","v":-0.1975521354055445},null,0.11319400000000002,691.17698872239737]
[100000,"2020-01-03","2024-01-01",13.8865,13.873900000000001,13.8809,830.10276199999998,13.7841,14.673299999999999,13.6013,14.49,null,"2024-01-01",{"$f":"WORKDAY(M11-1,1,Feriados!$A$2:$A$937)","v":"2024-01-02"},{"$f":"NETWORKDAYS($K$1,N11,Feriados!$A$2:$A$937)-1","v":361},0.13880900000000002,830.10276208721268,{"$f":"InterpolaPre(O11)","v":0.13810000000000011},6.2296810473583264E-4,null,null,null,null,null,null,null,null,null,null,null,null,null,{"$f":"AG12-1%","v":0.12319400000000001},670.21065990407624]
[100000,"2022-01-07","2024-04-01",13.7766,13.766,13.7712,805.69017399999996,13.649100000000001,14.565099999999999,13.467000000000001,14.382300000000001,null,"2024-04-01",{"$f":"WORKDAY(M12-1,1,Feriados!$A$2:$A$937)","v":"2024-04-01"},{"$f":"NETWORKDAYS($K$1,N12,Feriados!$A$2:$A$937)-1","v":422},0.137712,805.69017473475515,{"$f":"InterpolaPre(O12)","v":0.13700000000000001},6.2620932277934749E-4,null,null,null,null,null,null,null,null,null,null,null,null,null,{"$f":"AE6","v":0.13319400000000001},650.05779652662898,{"$f":"AH12","v":650.05779652662898}]
[100000,"2021-01-08","2024-07-01",13.6213,13.608000000000001,13.615,782.18291899999997,13.4437,14.395,13.271800000000001,14.2227,null,"2024-07-01",{"$f":"WORKDAY(M13-1,1,Feriados!$A$2:$A$937)","v":"2024-07-01"},{"$f":"NETWORKDAYS($K$1,N13,Feriados!$A$2:$A$937)-1","v":485},0.13614999999999999,782.18291963336173,{"$f":"InterpolaPre(O13)","v":0.13539999999999996},6.6056015501136933E-4,null,null,null,null,null,null,null,null,null,null,null,null,null,{"$f":"AG12+1%","v":0.14319400000000002},630.68007109117661]
[100000,"2022-07-08","2024-10-01",13.5268,13.5121,13.5189,757.86700499999995,13.295,14.2841,13.1379,14.1264,null,"2024-10-01",{"$f":"WORKDAY(M14-1,1,Feriados!$A$2:$A$937)","v":"2024-10-01"},{"$f":"NETWORKDAYS($K$1,N14,Feriados!$A$2:$A$937)-1","v":551},0.135189,757.86700574809629,{"$f":"InterpolaPre(O14)","v":0.13430000000000009},7.837432777924036E-4,null,null,null,null,null,null,null,null,null,null,null,null,null,{"$f":"AG13+1%","v":0.15319400000000002},612.04127526511013]
[100000,"2018-02-01","2025-01-01",13.346399999999999,13.332800000000001,13.34,736.68033100000002,13.1531,14.1751,12.9285,13.950100000000001,null,"2025-01-01",{"$f":"WORKDAY(M15-1,1,Feriados!$A$2:$A$937)","v":"2025-01-02"},{"$f":"NETWORKDAYS($K$1,N15,Feriados!$A$2:$A$937)-1","v":615},0.13339999999999999,736.680331689843,{"$f":"InterpolaPre(O15)","v":0.13270000000000004},6.1799240752180573E-4,null,null,null,null,null,null,null,null,null,null,null,null,null,0.16319400000000003,594.10718568292998]
{"$rows_left_out":5}
{"sheet":"Legendas","index":5,"n_rows":19,"n_cols":4,"rows_kept":19,"cut":false,"hidden":false,"merged":[]}
[]
[]
[]
[]
[]
[]
[null,"Código","Mês","Mês Num"]
[null,"F","Janeiro","01"]
[null,"G","Fevereiro","02"]
[null,"H","Março","03"]
[null,"J","Abril","04"]
[null,"K","Maio","05"]
[null,"M","Junho","06"]
[null,"N","Julho","07"]
[null,"Q","Agosto","08"]
{"$rows_left_out":5}
{"sheet":"Feriados","index":6,"n_rows":938,"n_cols":3,"rows_kept":938,"cut":false,"hidden":false,"merged":[]}
["Data","Dia da Semana","Feriado"]
["2001-01-01","segunda-feira","Confraternização Universal"]
["2001-02-26","segunda-feira","Carnaval"]
["2001-02-27","terça-feira","Carnaval"]
["2001-04-13","sexta-feira","Paixão de Cristo"]
["2001-04-21","sábado","Tiradentes"]
["2001-05-01","terça-feira","Dia do Trabalho"]
["2001-06-14","quinta-feira","Corpus Christi"]
["2001-09-07","sexta-feira","Independência do Brasil"]
["2001-10-12","sexta-feira","Nossa Sr.a Aparecida - Padroeira do Brasil"]
["2001-11-02","sexta-feira","Finados"]
["2001-11-15","quinta-feira","Proclamação da República"]
["2001-12-25","terça-feira","Natal"]
["2002-01-01","terça-feira","Confraternização Universal"]
["2002-02-11","segunda-feira","Carnaval"]
{"$rows_left_out":923}