{"text_format":"1","workbook":"xlsx","n_sheets":7,"sheets":["Resumo","Contratos em Aberto DI","Curva de Juros Pré","ETTJ x Contratos em Aberto","Reuniões do COPOM","Legendas","Feriados"],"not_rendered":{"charts":5,"images":1,"macros":1,"external_links":0,"defined_names":0,"comments":0,"pivot_tables":0},"unopened":[],"bounds":{"document_bytes":16777216,"sheet_cells":100000,"rows_first":2000,"rows_last":500,"rows_between":2000,"halvings":0,"cell_chars":16384,"cell_head_chars":4096},"cells_cut":0,"cells_raw":0,"read":"whole","date_system":"1900"}

{"sheet":"Resumo","index":0,"n_rows":41,"n_cols":10,"rows_kept":41,"cut":false,"hidden":false,"merged":[]}
[]
[null,"Série","Mês","Data","Preços","Dias","Taxa","Contratos","Variação","DV01"]
[null,null,"Vencimento","Vencimento","Futuros","Úteis","Pré","em Aberto","Quantidade"]
[null,{"$f":"'Contratos em Aberto DI'!A2","v":"X22"},{"$f":"VLOOKUP(MID(B4,1,1),Legendas!$B$8:$D$19,2,FALSE)","v":"Novembro"},{"$f":"WORKDAY(EOMONTH(\"15/\"&VLOOKUP(MID(B4,1,1),Legendas!$B$8:$D$19,3,FALSE)&\"/\"&\"20\"&RIGHT(B4,2),-1),1,Feriados!$A$2:$A$937)","v":"2022-11-01"},{"$f":"100000/(1+G4)^(F4/252)","v":99695.812722452858},{"$f":"NETWORKDAYS('Curva de Juros Pré'!$B$1,D4,Feriados!$A$2:$A$937)-1","v":6},{"$f":"InterpolaPre(F4)","v":0.13649999999999918},{"$f":"VLOOKUP(B4,'Contratos em Aberto DI'!$A$2:$C$40,2,FALSE)","v":721057},{"$f":"VLOOKUP(B4,'Contratos em Aberto DI'!$A$2:$C$40,3,FALSE)","v":-3770},{"$f":"100000/(1+G4+0.01%)^(F4/252)-100000/(1+G4)^(F4/252)","v":-0.20885199434997048}]
[null,{"$f":"'Contratos em Aberto DI'!A3","v":"Z22"},{"$f":"VLOOKUP(MID(B5,1,1),Legendas!$B$8:$D$19,2,FALSE)","v":"Dezembro"},{"$f":"WORKDAY(EOMONTH(\"15/\"&VLOOKUP(MID(B5,1,1),Legendas!$B$8:$D$19,3,FALSE)&\"/\"&\"20\"&RIGHT(B5,2),-1),1,Feriados!$A$2:$A$937)","v":"2022-12-01"},{"$f":"100000/(1+G5)^(F5/252)","v":98686.730381690024},{"$f":"NETWORKDAYS('Curva de Juros Pré'!$B$1,D5,Feriados!$A$2:$A$937)-1","v":26},{"$f":"InterpolaPre(F5)","v":0.13669999999999982},{"$f":"VLOOKUP(B5,'Contratos em Aberto DI'!$A$2:$C$40,2,FALSE)","v":447222},{"$f":"VLOOKUP(B5,'Contratos em Aberto DI'!$A$2:$C$40,3,FALSE)","v":-1475},{"$f":"100000/(1+G5+0.01%)^(F5/252)-100000/(1+G5)^(F5/252)","v":-0.89570424854173325}]
[null,{"$f":"'Contratos em Aberto DI'!A4","v":"F23"},{"$f":"VLOOKUP(MID(B6,1,1),Legendas!$B$8:$D$19,2,FALSE)","v":"Janeiro"},{"$f":"WORKDAY(EOMONTH(\"15/\"&VLOOKUP(MID(B6,1,1),Legendas!$B$8:$D$19,3,FALSE)&\"/\"&\"20\"&RIGHT(B6,2),-1),1,Feriados!$A$2:$A$937)","v":"2023-01-02"},97585.711956696148,{"$f":"NETWORKDAYS('Curva de Juros Pré'!$B$1,D6,Feriados!$A$2:$A$937)-1","v":48},{"$f":"InterpolaPre(F6)","v":0.1368999999999998},{"$f":"VLOOKUP(B6,'Contratos em Aberto DI'!$A$2:$C$40,2,FALSE)","v":5761509},{"$f":"VLOOKUP(B6,'Contratos em Aberto DI'!$A$2:$C$40,3,FALSE)","v":23135},-1.6348651188309304]
[null,{"$f":"'Contratos em Aberto DI'!A5","v":"G23"},{"$f":"VLOOKUP(MID(B7,1,1),Legendas!$B$8:$D$19,2,FALSE)","v":"Fevereiro"},{"$f":"WORKDAY(EOMONTH(\"15/\"&VLOOKUP(MID(B7,1,1),Legendas!$B$8:$D$19,3,FALSE)&\"/\"&\"20\"&RIGHT(B7,2),-1),1,Feriados!$A$2:$A$937)","v":"2023-02-01"},96498.728871836807,{"$f":"NETWORKDAYS('Curva de Juros Pré'!$B$1,D7,Feriados!$A$2:$A$937)-1","v":70},{"$f":"InterpolaPre(F7)","v":0.1368999999999998},{"$f":"VLOOKUP(B7,'Contratos em Aberto DI'!$A$2:$C$40,2,FALSE)","v":170475},{"$f":"VLOOKUP(B7,'Contratos em Aberto DI'!$A$2:$C$40,3,FALSE)","v":10770},-2.3576124749670271]
[null,{"$f":"'Contratos em Aberto DI'!A6","v":"H23"},{"$f":"VLOOKUP(MID(B8,1,1),Legendas!$B$8:$D$19,2,FALSE)","v":"Março"},{"$f":"WORKDAY(EOMONTH(\"15/\"&VLOOKUP(MID(B8,1,1),Legendas!$B$8:$D$19,3,FALSE)&\"/\"&\"20\"&RIGHT(B8,2),-1),1,Feriados!$A$2:$A$937)","v":"2023-03-01"},95615.454046213257,{"$f":"NETWORKDAYS('Curva de Juros Pré'!$B$1,D8,Feriados!$A$2:$A$937)-1","v":88},{"$f":"InterpolaPre(F8)","v":0.13699999999999979},{"$f":"VLOOKUP(B8,'Contratos em Aberto DI'!$A$2:$C$40,2,FALSE)","v":134242},{"$f":"VLOOKUP(B8,'Contratos em Aberto DI'!$A$2:$C$40,3,FALSE)","v":335},-2.9364593411737587]
[null,{"$f":"'Contratos em Aberto DI'!A7","v":"J23"},{"$f":"VLOOKUP(MID(B9,1,1),Legendas!$B$8:$D$19,2,FALSE)","v":"Abril"},{"$f":"WORKDAY(EOMONTH(\"15/\"&VLOOKUP(MID(B9,1,1),Legendas!$B$8:$D$19,3,FALSE)&\"/\"&\"20\"&RIGHT(B9,2),-1),1,Feriados!$A$2:$A$937)","v":"2023-04-03"},94501.530663314974,{"$f":"NETWORKDAYS('Curva de Juros Pré'!$B$1,D9,Feriados!$A$2:$A$937)-1","v":111},{"$f":"InterpolaPre(F9)","v":0.13700000000000001},{"$f":"VLOOKUP(B9,'Contratos em Aberto DI'!$A$2:$C$40,2,FALSE)","v":1115201},{"$f":"VLOOKUP(B9,'Contratos em Aberto DI'!$A$2:$C$40,3,FALSE)","v":-19860},-3.6607772745192051]
[null,{"$f":"'Contratos em Aberto DI'!A8","v":"K23"},{"$f":"VLOOKUP(MID(B10,1,1),Legendas!$B$8:$D$19,2,FALSE)","v":"Maio"},{"$f":"WORKDAY(EOMONTH(\"15/\"&VLOOKUP(MID(B10,1,1),Legendas!$B$8:$D$19,3,FALSE)&\"/\"&\"20\"&RIGHT(B10,2),-1),1,Feriados!$A$2:$A$937)","v":"2023-05-02"},93647.257199789048,{"$f":"NETWORKDAYS('Curva de Juros Pré'!$B$1,D10,Feriados!$A$2:$A$937)-1","v":129},{"$f":"InterpolaPre(F10)","v":0.13680000000000003},{"$f":"VLOOKUP(B10,'Contratos em Aberto DI'!$A$2:$C$40,2,FALSE)","v":95402},{"$f":"VLOOKUP(B10,'Contratos em Aberto DI'!$A$2:$C$40,3,FALSE)","v":0},-4.2166862516460242]
[null,{"$f":"'Contratos em Aberto DI'!A9","v":"M23"},{"$f":"VLOOKUP(MID(B11,1,1),Legendas!$B$8:$D$19,2,FALSE)","v":"Junho"},{"$f":"WORKDAY(EOMONTH(\"15/\"&VLOOKUP(MID(B11,1,1),Legendas!$B$8:$D$19,3,FALSE)&\"/\"&\"20\"&RIGHT(B11,2),-1),1,Feriados!$A$2:$A$937)","v":"2023-06-01"},92629.269278911554,{"$f":"NETWORKDAYS('Curva de Juros Pré'!$B$1,D11,Feriados!$A$2:$A$937)-1","v":151},{"$f":"InterpolaPre(F11)","v":0.13630000000000009},{"$f":"VLOOKUP(B11,'Contratos em Aberto DI'!$A$2:$C$40,2,FALSE)","v":49640},{"$f":"VLOOKUP(B11,'Contratos em Aberto DI'!$A$2:$C$40,3,FALSE)","v":-40},-4.8842859110009158]
[null,{"$f":"'Contratos em Aberto DI'!A10","v":"N23"},{"$f":"VLOOKUP(MID(B12,1,1),Legendas!$B$8:$D$19,2,FALSE)","v":"Julho"},{"$f":"WORKDAY(EOMONTH(\"15/\"&VLOOKUP(MID(B12,1,1),Legendas!$B$8:$D$19,3,FALSE)&\"/\"&\"20\"&RIGHT(B12,2),-1),1,Feriados!$A$2:$A$937)","v":"2023-07-03"},91697.753113015919,{"$f":"NETWORKDAYS('Curva de Juros Pré'!$B$1,D12,Feriados!$A$2:$A$937)-1","v":172},{"$f":"InterpolaPre(F12)","v":0.13539999999999996},{"$f":"VLOOKUP(B12,'Contratos em Aberto DI'!$A$2:$C$40,2,FALSE)","v":2497117},{"$f":"VLOOKUP(B12,'Contratos em Aberto DI'!$A$2:$C$40,3,FALSE)","v":-6128},-5.5119533451506868]
[null,{"$f":"'Contratos em Aberto DI'!A11","v":"Q23"},{"$f":"VLOOKUP(MID(B13,1,1),Legendas!$B$8:$D$19,2,FALSE)","v":"Agosto"},{"$f":"WORKDAY(EOMONTH(\"15/\"&VLOOKUP(MID(B13,1,1),Legendas!$B$8:$D$19,3,FALSE)&\"/\"&\"20\"&RIGHT(B13,2),-1),1,Feriados!$A$2:$A$937)","v":"2023-08-01"},90787.636917443611,{"$f":"NETWORKDAYS('Curva de Juros Pré'!$B$1,D13,Feriados!$A$2:$A$937)-1","v":193},{"$f":"InterpolaPre(F13)","v":0.13450000000000006},{"$f":"VLOOKUP(B13,'Contratos em Aberto DI'!$A$2:$C$40,2,FALSE)","v":45660},{"$f":"VLOOKUP(B13,'Contratos em Aberto DI'!$A$2:$C$40,3,FALSE)","v":0},-6.1283728818380041]
[null,{"$f":"'Contratos em Aberto DI'!A12","v":"U23"},{"$f":"VLOOKUP(MID(B14,1,1),Legendas!$B$8:$D$19,2,FALSE)","v":"Setembro"},{"$f":"WORKDAY(EOMONTH(\"15/\"&VLOOKUP(MID(B14,1,1),Legendas!$B$8:$D$19,3,FALSE)&\"/\"&\"20\"&RIGHT(B14,2),-1),1,Feriados!$A$2:$A$937)","v":"2023-09-01"},89822.641257257841,{"$f":"NETWORKDAYS('Curva de Juros Pré'!$B$1,D14,Feriados!$A$2:$A$937)-1","v":216},{"$f":"InterpolaPre(F14)","v":0.13339999999999974},{"$f":"VLOOKUP(B14,'Contratos em Aberto DI'!$A$2:$C$40,2,FALSE)","v":44090},{"$f":"VLOOKUP(B14,'Contratos em Aberto DI'!$A$2:$C$40,3,FALSE)","v":-20},-6.7923529373365454]
[null,{"$f":"'Contratos em Aberto DI'!A13","v":"V23"},{"$f":"VLOOKUP(MID(B15,1,1),Legendas!$B$8:$D$19,2,FALSE)","v":"Outubro"},{"$f":"WORKDAY(EOMONTH(\"15/\"&VLOOKUP(MID(B15,1,1),Legendas!$B$8:$D$19,3,FALSE)&\"/\"&\"20\"&RIGHT(B15,2),-1),1,Feriados!$A$2:$A$937)","v":"2023-10-02"},89007.930172818858,{"$f":"NETWORKDAYS('Curva de Juros Pré'!$B$1,D15,Feriados!$A$2:$A$937)-1","v":236},{"$f":"InterpolaPre(F15)","v":0.13240000000000007},{"$f":"VLOOKUP(B15,'Contratos em Aberto DI'!$A$2:$C$40,2,FALSE)","v":395875},{"$f":"VLOOKUP(B15,'Contratos em Aberto DI'!$A$2:$C$40,3,FALSE)","v":-5710},-7.3604297298152233]
{"$rows_left_out":27}
{"sheet":"Contratos em Aberto DI","index":1,"n_rows":39,"n_cols":5,"rows_kept":39,"cut":false,"hidden":false,"merged":[[0,0,0,2]]}
[null,null,null,"Site:","https://www.b3.com.br/pt_br/market-data-e-indices/servicos-de-dados/market-data/consultas/mercado-de-derivativos/contratos-em-aberto/vencimento-serie/contratos-em-aberto-futuro/"]
["X22",721057,-3770]
["Z22",447222,-1475]
["F23",5761509,23135]
["G23",170475,10770]
["H23",134242,335]
["J23",1115201,-19860]
["K23",95402,0]
["M23",49640,-40]
["N23",2497117,-6128]
["Q23",45660,0]
["U23",44090,-20]
["V23",395875,-5710]
["F24",4766724,-36613]
["J24",835139,4973]
{"$rows_left_out":25}
{"sheet":"Curva de Juros Pré","index":2,"n_rows":270,"n_cols":3,"rows_kept":270,"cut":false,"hidden":false,"merged":[]}
["Data","2022-10-24","https://www.b3.com.br/pt_br/market-data-e-indices/servicos-de-dados/market-data/consultas/mercado-de-derivativos/precos-referenciais/taxas-referenciais-bm-fbovespa/"]
[]
["DC","DU","ETTJ Pré"]
[1,{"$f":"NETWORKDAYS($B$1,$B$1+A4,Feriados!$A$2:$A$937)-1","v":1},0.13650000000000001]
[4,{"$f":"NETWORKDAYS($B$1,$B$1+A5,Feriados!$A$2:$A$937)-1","v":4},0.13650000000000001]
[7,{"$f":"NETWORKDAYS($B$1,$B$1+A6,Feriados!$A$2:$A$937)-1","v":5},0.13650000000000001]
[8,{"$f":"NETWORKDAYS($B$1,$B$1+A7,Feriados!$A$2:$A$937)-1","v":6},0.13650000000000001]
[14,{"$f":"NETWORKDAYS($B$1,$B$1+A8,Feriados!$A$2:$A$937)-1","v":9},0.1366]
[21,{"$f":"NETWORKDAYS($B$1,$B$1+A9,Feriados!$A$2:$A$937)-1","v":14},0.13669999999999999]
[23,{"$f":"NETWORKDAYS($B$1,$B$1+A10,Feriados!$A$2:$A$937)-1","v":15},0.13669999999999999]
[25,{"$f":"NETWORKDAYS($B$1,$B$1+A11,Feriados!$A$2:$A$937)-1","v":17},0.13669999999999999]
[30,{"$f":"NETWORKDAYS($B$1,$B$1+A12,Feriados!$A$2:$A$937)-1","v":20},0.13669999999999999]
[35,{"$f":"NETWORKDAYS($B$1,$B$1+A13,Feriados!$A$2:$A$937)-1","v":23},0.13669999999999999]
[36,{"$f":"NETWORKDAYS($B$1,$B$1+A14,Feriados!$A$2:$A$937)-1","v":24},0.13669999999999999]
[37,{"$f":"NETWORKDAYS($B$1,$B$1+A15,Feriados!$A$2:$A$937)-1","v":25},0.13669999999999999]
{"$rows_left_out":256}
{"sheet":"ETTJ x Contratos em Aberto","index":3,"n_rows":40,"n_cols":23,"rows_kept":40,"cut":false,"hidden":false,"merged":[]}
[]
[null,null,null,null,null,null,null,null,null,null,null,"Min. Liquidez Desejada",null,0,null,null,"Vencimento","Série","Taxa","Contratos","DV01",null,0]
[null,null,null,null,null,null,null,null,null,null,null,null,null,null,null,null,{"$f":"Resumo!D4","v":"2022-11-01"},{"$f":"Resumo!B4","v":"X22"},{"$f":"Resumo!G4","v":0.13649999999999918},{"$f":"IF(Resumo!H4>'ETTJ x Contratos em Aberto'!$N$2,Resumo!H4,NA())","v":721057},{"$f":"IF(Resumo!H4>'ETTJ x Contratos em Aberto'!$N$2,Resumo!J4,NA())","v":-0.20885199434997048},null,500000]
[null,null,null,null,null,null,null,null,null,null,null,null,null,null,null,null,{"$f":"Resumo!D5","v":"2022-12-01"},{"$f":"Resumo!B5","v":"Z22"},{"$f":"Resumo!G5","v":0.13669999999999982},{"$f":"IF(Resumo!H5>'ETTJ x Contratos em Aberto'!$N$2,Resumo!H5,NA())","v":447222},{"$f":"IF(Resumo!H5>'ETTJ x Contratos em Aberto'!$N$2,Resumo!J5,NA())","v":-0.89570424854173325},null,1000000]
[null,null,null,null,null,null,null,null,null,null,null,null,null,null,null,null,{"$f":"Resumo!D6","v":"2023-01-02"},{"$f":"Resumo!B6","v":"F23"},{"$f":"Resumo!G6","v":0.1368999999999998},{"$f":"IF(Resumo!H6>'ETTJ x Contratos em Aberto'!$N$2,Resumo!H6,NA())","v":5761509},{"$f":"IF(Resumo!H6>'ETTJ x Contratos em Aberto'!$N$2,Resumo!J6,NA())","v":-1.6348651188309304},null,1500000]
[null,null,null,null,null,null,null,null,null,null,null,null,null,null,null,null,{"$f":"Resumo!D7","v":"2023-02-01"},{"$f":"Resumo!B7","v":"G23"},{"$f":"Resumo!G7","v":0.1368999999999998},{"$f":"IF(Resumo!H7>'ETTJ x Contratos em Aberto'!$N$2,Resumo!H7,NA())","v":170475},{"$f":"IF(Resumo!H7>'ETTJ x Contratos em Aberto'!$N$2,Resumo!J7,NA())","v":-2.3576124749670271},null,2000000]
[null,null,null,null,null,null,null,null,null,null,null,null,null,null,null,null,{"$f":"Resumo!D8","v":"2023-03-01"},{"$f":"Resumo!B8","v":"H23"},{"$f":"Resumo!G8","v":0.13699999999999979},{"$f":"IF(Resumo!H8>'ETTJ x Contratos em Aberto'!$N$2,Resumo!H8,NA())","v":134242},{"$f":"IF(Resumo!H8>'ETTJ x Contratos em Aberto'!$N$2,Resumo!J8,NA())","v":-2.9364593411737587},null,3000000]
[null,null,null,null,null,null,null,null,null,null,null,null,null,null,null,null,{"$f":"Resumo!D9","v":"2023-04-03"},{"$f":"Resumo!B9","v":"J23"},{"$f":"Resumo!G9","v":0.13700000000000001},{"$f":"IF(Resumo!H9>'ETTJ x Contratos em Aberto'!$N$2,Resumo!H9,NA())","v":1115201},{"$f":"IF(Resumo!H9>'ETTJ x Contratos em Aberto'!$N$2,Resumo!J9,NA())","v":-3.6607772745192051},null,4000000]
[null,null,null,null,null,null,null,null,null,null,null,null,null,null,null,null,{"$f":"Resumo!D10","v":"2023-05-02"},{"$f":"Resumo!B10","v":"K23"},{"$f":"Resumo!G10","v":0.13680000000000003},{"$f":"IF(Resumo!H10>'ETTJ x Contratos em Aberto'!$N$2,Resumo!H10,NA())","v":95402},{"$f":"IF(Resumo!H10>'ETTJ x Contratos em Aberto'!$N$2,Resumo!J10,NA())","v":-4.2166862516460242},null,5000000]
[null,null,null,null,null,null,null,null,null,null,null,null,null,null,null,null,{"$f":"Resumo!D11","v":"2023-06-01"},{"$f":"Resumo!B11","v":"M23"},{"$f":"Resumo!G11","v":0.13630000000000009},{"$f":"IF(Resumo!H11>'ETTJ x Contratos em Aberto'!$N$2,Resumo!H11,NA())","v":49640},{"$f":"IF(Resumo!H11>'ETTJ x Contratos em Aberto'!$N$2,Resumo!J11,NA())","v":-4.8842859110009158}]
[null,null,null,null,null,null,null,null,null,null,null,null,null,null,null,null,{"$f":"Resumo!D12","v":"2023-07-03"},{"$f":"Resumo!B12","v":"N23"},{"$f":"Resumo!G12","v":0.13539999999999996},{"$f":"IF(Resumo!H12>'ETTJ x Contratos em Aberto'!$N$2,Resumo!H12,NA())","v":2497117},{"$f":"IF(Resumo!H12>'ETTJ x Contratos em Aberto'!$N$2,Resumo!J12,NA())","v":-5.5119533451506868}]
[null,null,null,null,null,null,null,null,null,null,null,null,null,null,null,null,{"$f":"Resumo!D13","v":"2023-08-01"},{"$f":"Resumo!B13","v":"Q23"},{"$f":"Resumo!G13","v":0.13450000000000006},{"$f":"IF(Resumo!H13>'ETTJ x Contratos em Aberto'!$N$2,Resumo!H13,NA())","v":45660},{"$f":"IF(Resumo!H13>'ETTJ x Contratos em Aberto'!$N$2,Resumo!J13,NA())","v":-6.1283728818380041}]
[null,null,null,null,null,null,null,null,null,null,null,null,null,null,null,null,{"$f":"Resumo!D14","v":"2023-09-01"},{"$f":"Resumo!B14","v":"U23"},{"$f":"Resumo!G14","v":0.13339999999999974},{"$f":"IF(Resumo!H14>'ETTJ x Contratos em Aberto'!$N$2,Resumo!H14,NA())","v":44090},{"$f":"IF(Resumo!H14>'ETTJ x Contratos em Aberto'!$N$2,Resumo!J14,NA())","v":-6.7923529373365454}]
[null,null,null,null,null,null,null,null,null,null,null,null,null,null,null,null,{"$f":"Resumo!D15","v":"2023-10-02"},{"$f":"Resumo!B15","v":"V23"},{"$f":"Resumo!G15","v":0.13240000000000007},{"$f":"IF(Resumo!H15>'ETTJ x Contratos em Aberto'!$N$2,Resumo!H15,NA())","v":395875},{"$f":"IF(Resumo!H15>'ETTJ x Contratos em Aberto'!$N$2,Resumo!J15,NA())","v":-7.3604297298152233}]
[null,null,null,null,null,null,null,null,null,null,null,null,null,null,null,null,{"$f":"Resumo!D16","v":"2024-01-02"},{"$f":"Resumo!B16","v":"F24"},{"$f":"Resumo!G16","v":0.12880000000000003},{"$f":"IF(Resumo!H16>'ETTJ x Contratos em Aberto'!$N$2,Resumo!H16,NA())","v":4766724},{"$f":"IF(Resumo!H16>'ETTJ x Contratos em Aberto'!$N$2,Resumo!J16,NA())","v":-9.0507403681112919}]
{"$rows_left_out":26}
{"sheet":"Reuniões do COPOM","index":4,"n_rows":24,"n_cols":7,"rows_kept":24,"cut":false,"hidden":false,"merged":[]}
[null,"Data Atual",{"$f":"'Curva de Juros Pré'!B1","v":"2022-10-24"}]
[null,"Taxa DI",0.13650000000000001]
[]
[null,"Reuniões","Dias","ETTJ B3"]
[null,"COPOM","Úteis","Spot","Forward","D","Movimento*"]
[null,"2022-10-26",{"$f":"NETWORKDAYS($C$1,B6,Feriados!$A$2:$A$937)-1","v":2},{"$f":"InterpolaPre(C6)","v":0.13650000000001516},{"$f":"Forward($C$1,C1,B6,C2,D6,Feriados!$A$2:$A$937)","v":0.13650000000001516},{"$f":"E6-C2","v":1.5154544286133387E-14},{"$f":"IF(F6>$C$22,\"Alta\",IF(F6<-$C$22,\"Corte\",\"Manutenção\"))","v":"Manutenção"}]
[null,"2022-12-07",{"$f":"NETWORKDAYS($C$1,B7,Feriados!$A$2:$A$937)-1","v":30},{"$f":"InterpolaPre(C7)","v":0.13677111020751243},{"$f":"Forward($C$1,B6,B7,D6,D7,Feriados!$A$2:$A$937)","v":0.13680016156530006},{"$f":"E7-E6","v":3.0016156528489546E-4},{"$f":"IF(F7>$C$22,\"Alta\",IF(F7<-$C$22,\"Corte\",\"Manutenção\"))","v":"Manutenção"}]
[null,"2023-02-01",{"$f":"NETWORKDAYS($C$1,B8,Feriados!$A$2:$A$937)-1","v":70},{"$f":"InterpolaPre(C8)","v":0.1368999999999998},{"$f":"Forward($C$1,B7,B8,D7,D8,Feriados!$A$2:$A$937)","v":0.13699989964066583},{"$f":"E8-E7","v":1.9973807536577404E-4},{"$f":"IF(F8>$C$22,\"Alta\",IF(F8<-$C$22,\"Corte\",\"Manutenção\"))","v":"Manutenção"}]
[null,"2023-03-22",{"$f":"NETWORKDAYS($C$1,B9,Feriados!$A$2:$A$937)-1","v":103},{"$f":"InterpolaPre(C9)","v":0.13700000000000001},{"$f":"Forward($C$1,B8,B9,D8,D9,Feriados!$A$2:$A$937)","v":0.1372151813364284},2.1528169576257028E-4,{"$f":"IF(F9>$C$22,\"Alta\",IF(F9<-$C$22,\"Corte\",\"Manutenção\"))","v":"Manutenção"}]
[null,"2023-05-03",{"$f":"NETWORKDAYS($C$1,B10,Feriados!$A$2:$A$937)-1","v":130},{"$f":"InterpolaPre(C10)","v":0.13677640842586336},{"$f":"Forward($C$1,B9,B10,D9,D10,Feriados!$A$2:$A$937)","v":0.13591557759362005},-1.2996037428083529E-3,{"$f":"IF(F10>$C$22,\"Alta\",IF(F10<-$C$22,\"Corte\",\"Manutenção\"))","v":"Manutenção"}]
[null,"2023-06-21",{"$f":"NETWORKDAYS($C$1,B11,Feriados!$A$2:$A$937)-1","v":164},{"$f":"InterpolaPre(C11)","v":0.13569999999999993},{"$f":"Forward($C$1,B10,B11,D10,D11,Feriados!$A$2:$A$937)","v":0.1315621820590378},-4.3533955345822495E-3,{"$f":"IF(F11>$C$22,\"Alta\",IF(F11<-$C$22,\"Corte\",\"Manutenção\"))","v":"Corte"}]
[null,"2023-08-02",{"$f":"NETWORKDAYS($C$1,B12,Feriados!$A$2:$A$937)-1","v":194},{"$f":"InterpolaPre(C12)","v":0.13444767008668634},{"$f":"Forward($C$1,B11,B12,D11,D12,Feriados!$A$2:$A$937)","v":0.12758449902389346},-3.9776830351443415E-3,{"$f":"IF(F12>$C$22,\"Alta\",IF(F12<-$C$22,\"Corte\",\"Manutenção\"))","v":"Corte"}]
[null,"2023-09-20",{"$f":"NETWORKDAYS($C$1,B13,Feriados!$A$2:$A$937)-1","v":228},{"$f":"InterpolaPre(C13)","v":0.13274977959826662},{"$f":"Forward($C$1,B12,B13,D12,D13,Feriados!$A$2:$A$937)","v":0.12306084390345773},-4.5236551204357323E-3,{"$f":"IF(F13>$C$22,\"Alta\",IF(F13<-$C$22,\"Corte\",\"Manutenção\"))","v":"Corte"}]
[null,"2023-11-01",{"$f":"NETWORKDAYS($C$1,B14,Feriados!$A$2:$A$937)-1","v":257},{"$f":"InterpolaPre(C14)","v":0.13093788406020335},{"$f":"Forward($C$1,B13,B14,D13,D14,Feriados!$A$2:$A$937)","v":0.11673158698355501},-6.3292569199027149E-3,{"$f":"IF(F14>$C$22,\"Alta\",IF(F14<-$C$22,\"Corte\",\"Manutenção\"))","v":"Corte"}]
[null,"2023-12-13",{"$f":"NETWORKDAYS($C$1,B15,Feriados!$A$2:$A$937)-1","v":285},{"$f":"InterpolaPre(C15)","v":0.12929999999999997},{"$f":"Forward($C$1,B14,B15,D14,D15,Feriados!$A$2:$A$937)","v":0.1143192532897146},-2.4123336938404183E-3,{"$f":"IF(F15>$C$22,\"Alta\",IF(F15<-$C$22,\"Corte\",\"Manutenção\"))","v":"Corte"}]
{"$rows_left_out":10}
{"sheet":"Legendas","index":5,"n_rows":19,"n_cols":4,"rows_kept":19,"cut":false,"hidden":false,"merged":[]}
[]
[]
[]
[]
[]
[]
[null,"Código","Mês","Mês Num"]
[null,"F","Janeiro","01"]
[null,"G","Fevereiro","02"]
[null,"H","Março","03"]
[null,"J","Abril","04"]
[null,"K","Maio","05"]
[null,"M","Junho","06"]
[null,"N","Julho","07"]
[null,"Q","Agosto","08"]
{"$rows_left_out":5}
{"sheet":"Feriados","index":6,"n_rows":938,"n_cols":3,"rows_kept":938,"cut":false,"hidden":false,"merged":[]}
["Data","Dia da Semana","Feriado"]
["2001-01-01","segunda-feira","Confraternização Universal"]
["2001-02-26","segunda-feira","Carnaval"]
["2001-02-27","terça-feira","Carnaval"]
["2001-04-13","sexta-feira","Paixão de Cristo"]
["2001-04-21","sábado","Tiradentes"]
["2001-05-01","terça-feira","Dia do Trabalho"]
["2001-06-14","quinta-feira","Corpus Christi"]
["2001-09-07","sexta-feira","Independência do Brasil"]
["2001-10-12","sexta-feira","Nossa Sr.a Aparecida - Padroeira do Brasil"]
["2001-11-02","sexta-feira","Finados"]
["2001-11-15","quinta-feira","Proclamação da República"]
["2001-12-25","terça-feira","Natal"]
["2002-01-01","terça-feira","Confraternização Universal"]
["2002-02-11","segunda-feira","Carnaval"]
{"$rows_left_out":923}