{"text_format":"1","workbook":"xlsx","n_sheets":7,"sheets":["Resumo","Contratos em Aberto DI","Curva de Juros Pré","ETTJ x Contratos em Aberto","Reuniões do COPOM","Legendas","Feriados"],"not_rendered":{"charts":5,"images":1,"macros":1,"external_links":0,"defined_names":0,"comments":0,"pivot_tables":0},"unopened":[],"bounds":{"document_bytes":16777216,"sheet_cells":100000,"rows_first":2000,"rows_last":500,"rows_between":2000,"halvings":0,"cell_chars":16384,"cell_head_chars":4096},"cells_cut":0,"cells_raw":0,"read":"whole","date_system":"1900"}

{"sheet":"Resumo","index":0,"n_rows":41,"n_cols":10,"rows_kept":41,"cut":false,"hidden":false,"merged":[]}
[]
[null,"Série","Mês","Data","Preços","Dias","Taxa","Contratos","Variação","DV01"]
[null,null,"Vencimento","Vencimento","Futuros","Úteis","Pré","em Aberto","Quantidade"]
[null,{"$f":"'Contratos em Aberto DI'!A2","v":"X22"},{"$f":"VLOOKUP(MID(B4,1,1),Legendas!$B$8:$D$19,2,FALSE)","v":"Novembro"},{"$f":"WORKDAY(EOMONTH(\"15/\"&VLOOKUP(MID(B4,1,1),Legendas!$B$8:$D$19,3,FALSE)&\"/\"&\"20\"&RIGHT(B4,2),-1),1,Feriados!$A$2:$A$937)","v":"2022-11-01"},{"$f":"100000/(1+G4)^(F4/252)","v":99695.812722452858},{"$f":"NETWORKDAYS('Curva de Juros Pré'!$B$1,D4,Feriados!$A$2:$A$937)-1","v":6},{"$f":"InterpolaPre(F4)","v":0.13649999999999918},{"$f":"VLOOKUP(B4,'Contratos em Aberto DI'!$A$2:$C$40,2,FALSE)","v":721057},{"$f":"VLOOKUP(B4,'Contratos em Aberto DI'!$A$2:$C$40,3,FALSE)","v":-3770},{"$f":"100000/(1+G4+0.01%)^(F4/252)-100000/(1+G4)^(F4/252)","v":-0.20885199434997048}]
[null,{"$f":"'Contratos em Aberto DI'!A3","v":"Z22"},{"$f":"VLOOKUP(MID(B5,1,1),Legendas!$B$8:$D$19,2,FALSE)","v":"Dezembro"},{"$f":"WORKDAY(EOMONTH(\"15/\"&VLOOKUP(MID(B5,1,1),Legendas!$B$8:$D$19,3,FALSE)&\"/\"&\"20\"&RIGHT(B5,2),-1),1,Feriados!$A$2:$A$937)","v":"2022-12-01"},{"$f":"100000/(1+G5)^(F5/252)","v":98686.730381690024},{"$f":"NETWORKDAYS('Curva de Juros Pré'!$B$1,D5,Feriados!$A$2:$A$937)-1","v":26},{"$f":"InterpolaPre(F5)","v":0.13669999999999982},{"$f":"VLOOKUP(B5,'Contratos em Aberto DI'!$A$2:$C$40,2,FALSE)","v":447222},{"$f":"VLOOKUP(B5,'Contratos em Aberto DI'!$A$2:$C$40,3,FALSE)","v":-1475},{"$f":"100000/(1+G5+0.01%)^(F5/252)-100000/(1+G5)^(F5/252)","v":-0.89570424854173325}]
[null,{"$f":"'Contratos em Aberto DI'!A4","v":"F23"},{"$f":"VLOOKUP(MID(B6,1,1),Legendas!$B$8:$D$19,2,FALSE)","v":"Janeiro"},{"$f":"WORKDAY(EOMONTH(\"15/\"&VLOOKUP(MID(B6,1,1),Legendas!$B$8:$D$19,3,FALSE)&\"/\"&\"20\"&RIGHT(B6,2),-1),1,Feriados!$A$2:$A$937)","v":"2023-01-02"},97585.711956696148,{"$f":"NETWORKDAYS('Curva de Juros Pré'!$B$1,D6,Feriados!$A$2:$A$937)-1","v":48},{"$f":"InterpolaPre(F6)","v":0.1368999999999998},{"$f":"VLOOKUP(B6,'Contratos em Aberto DI'!$A$2:$C$40,2,FALSE)","v":5761509},{"$f":"VLOOKUP(B6,'Contratos em Aberto DI'!$A$2:$C$40,3,FALSE)","v":23135},-1.6348651188309304]
[null,{"$f":"'Contratos em Aberto DI'!A5","v":"G23"},{"$f":"VLOOKUP(MID(B7,1,1),Legendas!$B$8:$D$19,2,FALSE)","v":"Fevereiro"},{"$f":"WORKDAY(EOMONTH(\"15/\"&VLOOKUP(MID(B7,1,1),Legendas!$B$8:$D$19,3,FALSE)&\"/\"&\"20\"&RIGHT(B7,2),-1),1,Feriados!$A$2:$A$937)","v":"2023-02-01"},96498.728871836807,{"$f":"NETWORKDAYS('Curva de Juros Pré'!$B$1,D7,Feriados!$A$2:$A$937)-1","v":70},{"$f":"InterpolaPre(F7)","v":0.1368999999999998},{"$f":"VLOOKUP(B7,'Contratos em Aberto DI'!$A$2:$C$40,2,FALSE)","v":170475},{"$f":"VLOOKUP(B7,'Contratos em Aberto DI'!$A$2:$C$40,3,FALSE)","v":10770},-2.3576124749670271]
[null,{"$f":"'Contratos em Aberto DI'!A6","v":"H23"},{"$f":"VLOOKUP(MID(B8,1,1),Legendas!$B$8:$D$19,2,FALSE)","v":"Março"},{"$f":"WORKDAY(EOMONTH(\"15/\"&VLOOKUP(MID(B8,1,1),Legendas!$B$8:$D$19,3,FALSE)&\"/\"&\"20\"&RIGHT(B8,2),-1),1,Feriados!$A$2:$A$937)","v":"2023-03-01"},95615.454046213257,{"$f":"NETWORKDAYS('Curva de Juros Pré'!$B$1,D8,Feriados!$A$2:$A$937)-1","v":88},{"$f":"InterpolaPre(F8)","v":0.13699999999999979},{"$f":"VLOOKUP(B8,'Contratos em Aberto DI'!$A$2:$C$40,2,FALSE)","v":134242},{"$f":"VLOOKUP(B8,'Contratos em Aberto DI'!$A$2:$C$40,3,FALSE)","v":335},-2.9364593411737587]
[null,{"$f":"'Contratos em Aberto DI'!A7","v":"J23"},{"$f":"VLOOKUP(MID(B9,1,1),Legendas!$B$8:$D$19,2,FALSE)","v":"Abril"},{"$f":"WORKDAY(EOMONTH(\"15/\"&VLOOKUP(MID(B9,1,1),Legendas!$B$8:$D$19,3,FALSE)&\"/\"&\"20\"&RIGHT(B9,2),-1),1,Feriados!$A$2:$A$937)","v":"2023-04-03"},94501.530663314974,{"$f":"NETWORKDAYS('Curva de Juros Pré'!$B$1,D9,Feriados!$A$2:$A$937)-1","v":111},{"$f":"InterpolaPre(F9)","v":0.13700000000000001},{"$f":"VLOOKUP(B9,'Contratos em Aberto DI'!$A$2:$C$40,2,FALSE)","v":1115201},{"$f":"VLOOKUP(B9,'Contratos em Aberto DI'!$A$2:$C$40,3,FALSE)","v":-19860},-3.6607772745192051]
[null,{"$f":"'Contratos em Aberto DI'!A8","v":"K23"},{"$f":"VLOOKUP(MID(B10,1,1),Legendas!$B$8:$D$19,2,FALSE)","v":"Maio"},{"$f":"WORKDAY(EOMONTH(\"15/\"&VLOOKUP(MID(B10,1,1),Legendas!$B$8:$D$19,3,FALSE)&\"/\"&\"20\"&RIGHT(B10,2),-1),1,Feriados!$A$2:$A$937)","v":"2023-05-02"},93647.257199789048,{"$f":"NETWORKDAYS('Curva de Juros Pré'!$B$1,D10,Feriados!$A$2:$A$937)-1","v":129},{"$f":"InterpolaPre(F10)","v":0.13680000000000003},{"$f":"VLOOKUP(B10,'Contratos em Aberto DI'!$A$2:$C$40,2,FALSE)","v":95402},{"$f":"VLOOKUP(B10,'Contratos em Aberto DI'!$A$2:$C$40,3,FALSE)","v":0},-4.2166862516460242]
[null,{"$f":"'Contratos em Aberto DI'!A9","v":"M23"},{"$f":"VLOOKUP(MID(B11,1,1),Legendas!$B$8:$D$19,2,FALSE)","v":"Junho"},{"$f":"WORKDAY(EOMONTH(\"15/\"&VLOOKUP(MID(B11,1,1),Legendas!$B$8:$D$19,3,FALSE)&\"/\"&\"20\"&RIGHT(B11,2),-1),1,Feriados!$A$2:$A$937)","v":"2023-06-01"},92629.269278911554,{"$f":"NETWORKDAYS('Curva de Juros Pré'!$B$1,D11,Feriados!$A$2:$A$937)-1","v":151},{"$f":"InterpolaPre(F11)","v":0.13630000000000009},{"$f":"VLOOKUP(B11,'Contratos em Aberto DI'!$A$2:$C$40,2,FALSE)","v":49640},{"$f":"VLOOKUP(B11,'Contratos em Aberto DI'!$A$2:$C$40,3,FALSE)","v":-40},-4.8842859110009158]
[null,{"$f":"'Contratos em Aberto DI'!A10","v":"N23"},{"$f":"VLOOKUP(MID(B12,1,1),Legendas!$B$8:$D$19,2,FALSE)","v":"Julho"},{"$f":"WORKDAY(EOMONTH(\"15/\"&VLOOKUP(MID(B12,1,1),Legendas!$B$8:$D$19,3,FALSE)&\"/\"&\"20\"&RIGHT(B12,2),-1),1,Feriados!$A$2:$A$937)","v":"2023-07-03"},91697.753113015919,{"$f":"NETWORKDAYS('Curva de Juros Pré'!$B$1,D12,Feriados!$A$2:$A$937)-1","v":172},{"$f":"InterpolaPre(F12)","v":0.13539999999999996},{"$f":"VLOOKUP(B12,'Contratos em Aberto DI'!$A$2:$C$40,2,FALSE)","v":2497117},{"$f":"VLOOKUP(B12,'Contratos em Aberto DI'!$A$2:$C$40,3,FALSE)","v":-6128},-5.5119533451506868]
[null,{"$f":"'Contratos em Aberto DI'!A11","v":"Q23"},{"$f":"VLOOKUP(MID(B13,1,1),Legendas!$B$8:$D$19,2,FALSE)","v":"Agosto"},{"$f":"WORKDAY(EOMONTH(\"15/\"&VLOOKUP(MID(B13,1,1),Legendas!$B$8:$D$19,3,FALSE)&\"/\"&\"20\"&RIGHT(B13,2),-1),1,Feriados!$A$2:$A$937)","v":"2023-08-01"},90787.636917443611,{"$f":"NETWORKDAYS('Curva de Juros Pré'!$B$1,D13,Feriados!$A$2:$A$937)-1","v":193},{"$f":"InterpolaPre(F13)","v":0.13450000000000006},{"$f":"VLOOKUP(B13,'Contratos em Aberto DI'!$A$2:$C$40,2,FALSE)","v":45660},{"$f":"VLOOKUP(B13,'Contratos em Aberto DI'!$A$2:$C$40,3,FALSE)","v":0},-6.1283728818380041]
[null,{"$f":"'Contratos em Aberto DI'!A12","v":"U23"},{"$f":"VLOOKUP(MID(B14,1,1),Legendas!$B$8:$D$19,2,FALSE)","v":"Setembro"},{"$f":"WORKDAY(EOMONTH(\"15/\"&VLOOKUP(MID(B14,1,1),Legendas!$B$8:$D$19,3,FALSE)&\"/\"&\"20\"&RIGHT(B14,2),-1),1,Feriados!$A$2:$A$937)","v":"2023-09-01"},89822.641257257841,{"$f":"NETWORKDAYS('Curva de Juros Pré'!$B$1,D14,Feriados!$A$2:$A$937)-1","v":216},{"$f":"InterpolaPre(F14)","v":0.13339999999999974},{"$f":"VLOOKUP(B14,'Contratos em Aberto DI'!$A$2:$C$40,2,FALSE)","v":44090},{"$f":"VLOOKUP(B14,'Contratos em Aberto DI'!$A$2:$C$40,3,FALSE)","v":-20},-6.7923529373365454]
[null,{"$f":"'Contratos em Aberto DI'!A13","v":"V23"},{"$f":"VLOOKUP(MID(B15,1,1),Legendas!$B$8:$D$19,2,FALSE)","v":"Outubro"},{"$f":"WORKDAY(EOMONTH(\"15/\"&VLOOKUP(MID(B15,1,1),Legendas!$B$8:$D$19,3,FALSE)&\"/\"&\"20\"&RIGHT(B15,2),-1),1,Feriados!$A$2:$A$937)","v":"2023-10-02"},89007.930172818858,{"$f":"NETWORKDAYS('Curva de Juros Pré'!$B$1,D15,Feriados!$A$2:$A$937)-1","v":236},{"$f":"InterpolaPre(F15)","v":0.13240000000000007},{"$f":"VLOOKUP(B15,'Contratos em Aberto DI'!$A$2:$C$40,2,FALSE)","v":395875},{"$f":"VLOOKUP(B15,'Contratos em Aberto DI'!$A$2:$C$40,3,FALSE)","v":-5710},-7.3604297298152233]
[null,{"$f":"'Contratos em Aberto DI'!A14","v":"F24"},{"$f":"VLOOKUP(MID(B16,1,1),Legendas!$B$8:$D$19,2,FALSE)","v":"Janeiro"},{"$f":"WORKDAY(EOMONTH(\"15/\"&VLOOKUP(MID(B16,1,1),Legendas!$B$8:$D$19,3,FALSE)&\"/\"&\"20\"&RIGHT(B16,2),-1),1,Feriados!$A$2:$A$937)","v":"2024-01-02"},86693.613697339228,{"$f":"NETWORKDAYS('Curva de Juros Pré'!$B$1,D16,Feriados!$A$2:$A$937)-1","v":297},{"$f":"InterpolaPre(F16)","v":0.12880000000000003},{"$f":"VLOOKUP(B16,'Contratos em Aberto DI'!$A$2:$C$40,2,FALSE)","v":4766724},{"$f":"VLOOKUP(B16,'Contratos em Aberto DI'!$A$2:$C$40,3,FALSE)","v":-36613},-9.0507403681112919]
[null,{"$f":"'Contratos em Aberto DI'!A15","v":"J24"},{"$f":"VLOOKUP(MID(B17,1,1),Legendas!$B$8:$D$19,2,FALSE)","v":"Abril"},{"$f":"WORKDAY(EOMONTH(\"15/\"&VLOOKUP(MID(B17,1,1),Legendas!$B$8:$D$19,3,FALSE)&\"/\"&\"20\"&RIGHT(B17,2),-1),1,Feriados!$A$2:$A$937)","v":"2024-04-01"},84538.938548428487,{"$f":"NETWORKDAYS('Curva de Juros Pré'!$B$1,D17,Feriados!$A$2:$A$937)-1","v":358},{"$f":"InterpolaPre(F17)","v":0.12549999999999972},{"$f":"VLOOKUP(B17,'Contratos em Aberto DI'!$A$2:$C$40,2,FALSE)","v":835139},{"$f":"VLOOKUP(B17,'Contratos em Aberto DI'!$A$2:$C$40,3,FALSE)","v":4973},-10.669573931882042]
[null,{"$f":"'Contratos em Aberto DI'!A16","v":"N24"},{"$f":"VLOOKUP(MID(B18,1,1),Legendas!$B$8:$D$19,2,FALSE)","v":"Julho"},{"$f":"WORKDAY(EOMONTH(\"15/\"&VLOOKUP(MID(B18,1,1),Legendas!$B$8:$D$19,3,FALSE)&\"/\"&\"20\"&RIGHT(B18,2),-1),1,Feriados!$A$2:$A$937)","v":"2024-07-01"},82480.420779169872,{"$f":"NETWORKDAYS('Curva de Juros Pré'!$B$1,D18,Feriados!$A$2:$A$937)-1","v":421},{"$f":"InterpolaPre(F18)","v":0.12220000000000009},{"$f":"VLOOKUP(B18,'Contratos em Aberto DI'!$A$2:$C$40,2,FALSE)","v":934963},{"$f":"VLOOKUP(B18,'Contratos em Aberto DI'!$A$2:$C$40,3,FALSE)","v":5506},-12.277515298395883]
[null,{"$f":"'Contratos em Aberto DI'!A17","v":"V24"},{"$f":"VLOOKUP(MID(B19,1,1),Legendas!$B$8:$D$19,2,FALSE)","v":"Outubro"},{"$f":"WORKDAY(EOMONTH(\"15/\"&VLOOKUP(MID(B19,1,1),Legendas!$B$8:$D$19,3,FALSE)&\"/\"&\"20\"&RIGHT(B19,2),-1),1,Feriados!$A$2:$A$937)","v":"2024-10-01"},80358.922516496721,{"$f":"NETWORKDAYS('Curva de Juros Pré'!$B$1,D19,Feriados!$A$2:$A$937)-1","v":487},{"$f":"InterpolaPre(F19)","v":0.11979999999999991},{"$f":"VLOOKUP(B19,'Contratos em Aberto DI'!$A$2:$C$40,2,FALSE)","v":385270},{"$f":"VLOOKUP(B19,'Contratos em Aberto DI'!$A$2:$C$40,3,FALSE)","v":525},-13.866447077511111]
[null,{"$f":"'Contratos em Aberto DI'!A18","v":"F25"},{"$f":"VLOOKUP(MID(B20,1,1),Legendas!$B$8:$D$19,2,FALSE)","v":"Janeiro"},{"$f":"WORKDAY(EOMONTH(\"15/\"&VLOOKUP(MID(B20,1,1),Legendas!$B$8:$D$19,3,FALSE)&\"/\"&\"20\"&RIGHT(B20,2),-1),1,Feriados!$A$2:$A$937)","v":"2025-01-02"},78327.047184409763,{"$f":"NETWORKDAYS('Curva de Juros Pré'!$B$1,D20,Feriados!$A$2:$A$937)-1","v":551},{"$f":"InterpolaPre(F20)","v":0.11820000000000008},{"$f":"VLOOKUP(B20,'Contratos em Aberto DI'!$A$2:$C$40,2,FALSE)","v":3239147},{"$f":"VLOOKUP(B20,'Contratos em Aberto DI'!$A$2:$C$40,3,FALSE)","v":-25788},-15.31374630596838]
[null,{"$f":"'Contratos em Aberto DI'!A19","v":"J25"},{"$f":"VLOOKUP(MID(B21,1,1),Legendas!$B$8:$D$19,2,FALSE)","v":"Abril"},{"$f":"WORKDAY(EOMONTH(\"15/\"&VLOOKUP(MID(B21,1,1),Legendas!$B$8:$D$19,3,FALSE)&\"/\"&\"20\"&RIGHT(B21,2),-1),1,Feriados!$A$2:$A$937)","v":"2025-04-01"},76386.428188969163,{"$f":"NETWORKDAYS('Curva de Juros Pré'!$B$1,D21,Feriados!$A$2:$A$937)-1","v":612},{"$f":"InterpolaPre(F21)","v":0.11729999999999996},{"$f":"VLOOKUP(B21,'Contratos em Aberto DI'!$A$2:$C$40,2,FALSE)","v":90081},{"$f":"VLOOKUP(B21,'Contratos em Aberto DI'!$A$2:$C$40,3,FALSE)","v":-30},-16.600862597537343]
[null,{"$f":"'Contratos em Aberto DI'!A20","v":"N25"},{"$f":"VLOOKUP(MID(B22,1,1),Legendas!$B$8:$D$19,2,FALSE)","v":"Julho"},{"$f":"WORKDAY(EOMONTH(\"15/\"&VLOOKUP(MID(B22,1,1),Legendas!$B$8:$D$19,3,FALSE)&\"/\"&\"20\"&RIGHT(B22,2),-1),1,Feriados!$A$2:$A$937)","v":"2025-07-01"},74433.999967790514,{"$f":"NETWORKDAYS('Curva de Juros Pré'!$B$1,D22,Feriados!$A$2:$A$937)-1","v":673},{"$f":"InterpolaPre(F22)","v":0.1169},{"$f":"VLOOKUP(B22,'Contratos em Aberto DI'!$A$2:$C$40,2,FALSE)","v":994265},{"$f":"VLOOKUP(B22,'Contratos em Aberto DI'!$A$2:$C$40,3,FALSE)","v":-2810},-17.795091694846633]
[null,{"$f":"'Contratos em Aberto DI'!A21","v":"V25"},{"$f":"VLOOKUP(MID(B23,1,1),Legendas!$B$8:$D$19,2,FALSE)","v":"Outubro"},{"$f":"WORKDAY(EOMONTH(\"15/\"&VLOOKUP(MID(B23,1,1),Legendas!$B$8:$D$19,3,FALSE)&\"/\"&\"20\"&RIGHT(B23,2),-1),1,Feriados!$A$2:$A$937)","v":"2025-10-01"},72252.710932841801,{"$f":"NETWORKDAYS('Curva de Juros Pré'!$B$1,D23,Feriados!$A$2:$A$937)-1","v":739},{"$f":"InterpolaPre(F23)","v":0.11719999999999997},{"$f":"VLOOKUP(B23,'Contratos em Aberto DI'!$A$2:$C$40,2,FALSE)","v":61492},{"$f":"VLOOKUP(B23,'Contratos em Aberto DI'!$A$2:$C$40,3,FALSE)","v":-220},-18.962285708577838]
[null,{"$f":"'Contratos em Aberto DI'!A22","v":"F26"},{"$f":"VLOOKUP(MID(B24,1,1),Legendas!$B$8:$D$19,2,FALSE)","v":"Janeiro"},{"$f":"WORKDAY(EOMONTH(\"15/\"&VLOOKUP(MID(B24,1,1),Legendas!$B$8:$D$19,3,FALSE)&\"/\"&\"20\"&RIGHT(B24,2),-1),1,Feriados!$A$2:$A$937)","v":"2026-01-02"},70276.730410239645,{"$f":"NETWORKDAYS('Curva de Juros Pré'!$B$1,D24,Feriados!$A$2:$A$937)-1","v":804},{"$f":"InterpolaPre(F24)","v":0.1169},{"$f":"VLOOKUP(B24,'Contratos em Aberto DI'!$A$2:$C$40,2,FALSE)","v":1409237},{"$f":"VLOOKUP(B24,'Contratos em Aberto DI'!$A$2:$C$40,3,FALSE)","v":3024},-20.071105738956248]
[null,{"$f":"'Contratos em Aberto DI'!A23","v":"J26"},{"$f":"VLOOKUP(MID(B25,1,1),Legendas!$B$8:$D$19,2,FALSE)","v":"Abril"},{"$f":"WORKDAY(EOMONTH(\"15/\"&VLOOKUP(MID(B25,1,1),Legendas!$B$8:$D$19,3,FALSE)&\"/\"&\"20\"&RIGHT(B25,2),-1),1,Feriados!$A$2:$A$937)","v":"2026-04-01"},68357.895368725862,{"$f":"NETWORKDAYS('Curva de Juros Pré'!$B$1,D25,Feriados!$A$2:$A$937)-1","v":865},{"$f":"InterpolaPre(F25)","v":0.11719999999999997},{"$f":"VLOOKUP(B25,'Contratos em Aberto DI'!$A$2:$C$40,2,FALSE)","v":36370},{"$f":"VLOOKUP(B25,'Contratos em Aberto DI'!$A$2:$C$40,3,FALSE)","v":-120},-20.998446881014388]
[null,{"$f":"'Contratos em Aberto DI'!A24","v":"N26"},{"$f":"VLOOKUP(MID(B26,1,1),Legendas!$B$8:$D$19,2,FALSE)","v":"Julho"},{"$f":"WORKDAY(EOMONTH(\"15/\"&VLOOKUP(MID(B26,1,1),Legendas!$B$8:$D$19,3,FALSE)&\"/\"&\"20\"&RIGHT(B26,2),-1),1,Feriados!$A$2:$A$937)","v":"2026-07-01"},66548.449708534972,{"$f":"NETWORKDAYS('Curva de Juros Pré'!$B$1,D26,Feriados!$A$2:$A$937)-1","v":926},{"$f":"InterpolaPre(F26)","v":0.11719999999999997},{"$f":"VLOOKUP(B26,'Contratos em Aberto DI'!$A$2:$C$40,2,FALSE)","v":111945},{"$f":"VLOOKUP(B26,'Contratos em Aberto DI'!$A$2:$C$40,3,FALSE)","v":-570},-21.883995079362649]
[null,{"$f":"'Contratos em Aberto DI'!A25","v":"V26"},{"$f":"VLOOKUP(MID(B27,1,1),Legendas!$B$8:$D$19,2,FALSE)","v":"Outubro"},{"$f":"WORKDAY(EOMONTH(\"15/\"&VLOOKUP(MID(B27,1,1),Legendas!$B$8:$D$19,3,FALSE)&\"/\"&\"20\"&RIGHT(B27,2),-1),1,Feriados!$A$2:$A$937)","v":"2026-10-01"},64650.271768668419,{"$f":"NETWORKDAYS('Curva de Juros Pré'!$B$1,D27,Feriados!$A$2:$A$937)-1","v":991},{"$f":"InterpolaPre(F27)","v":0.11729999999999996},{"$f":"VLOOKUP(B27,'Contratos em Aberto DI'!$A$2:$C$40,2,FALSE)","v":52153},{"$f":"VLOOKUP(B27,'Contratos em Aberto DI'!$A$2:$C$40,3,FALSE)","v":-95},-22.749812009991729]
[null,{"$f":"'Contratos em Aberto DI'!A26","v":"F27"},{"$f":"VLOOKUP(MID(B28,1,1),Legendas!$B$8:$D$19,2,FALSE)","v":"Janeiro"},{"$f":"WORKDAY(EOMONTH(\"15/\"&VLOOKUP(MID(B28,1,1),Legendas!$B$8:$D$19,3,FALSE)&\"/\"&\"20\"&RIGHT(B28,2),-1),1,Feriados!$A$2:$A$937)","v":"2027-01-04"},62929.326664697139,{"$f":"NETWORKDAYS('Curva de Juros Pré'!$B$1,D28,Feriados!$A$2:$A$937)-1","v":1054},{"$f":"InterpolaPre(F28)","v":0.11709999999999998},{"$f":"VLOOKUP(B28,'Contratos em Aberto DI'!$A$2:$C$40,2,FALSE)","v":1043500},{"$f":"VLOOKUP(B28,'Contratos em Aberto DI'!$A$2:$C$40,3,FALSE)","v":-22377},-23.555936199561984]
[null,{"$f":"'Contratos em Aberto DI'!A27","v":"J27"},{"$f":"VLOOKUP(MID(B29,1,1),Legendas!$B$8:$D$19,2,FALSE)","v":"Abril"},{"$f":"WORKDAY(EOMONTH(\"15/\"&VLOOKUP(MID(B29,1,1),Legendas!$B$8:$D$19,3,FALSE)&\"/\"&\"20\"&RIGHT(B29,2),-1),1,Feriados!$A$2:$A$937)","v":"2027-04-01"},61267.582353465266,{"$f":"NETWORKDAYS('Curva de Juros Pré'!$B$1,D29,Feriados!$A$2:$A$937)-1","v":1114},{"$f":"InterpolaPre(F29)","v":0.11719999999999997},{"$f":"VLOOKUP(B29,'Contratos em Aberto DI'!$A$2:$C$40,2,FALSE)","v":25653},{"$f":"VLOOKUP(B29,'Contratos em Aberto DI'!$A$2:$C$40,3,FALSE)","v":285},-24.237014026162797]
[null,{"$f":"'Contratos em Aberto DI'!A28","v":"N27"},{"$f":"VLOOKUP(MID(B30,1,1),Legendas!$B$8:$D$19,2,FALSE)","v":"Julho"},{"$f":"WORKDAY(EOMONTH(\"15/\"&VLOOKUP(MID(B30,1,1),Legendas!$B$8:$D$19,3,FALSE)&\"/\"&\"20\"&RIGHT(B30,2),-1),1,Feriados!$A$2:$A$937)","v":"2027-07-01"},59568.471406919372,{"$f":"NETWORKDAYS('Curva de Juros Pré'!$B$1,D30,Feriados!$A$2:$A$937)-1","v":1177},{"$f":"InterpolaPre(F30)","v":0.11729999999999996},{"$f":"VLOOKUP(B30,'Contratos em Aberto DI'!$A$2:$C$40,2,FALSE)","v":23590},{"$f":"VLOOKUP(B30,'Contratos em Aberto DI'!$A$2:$C$40,3,FALSE)","v":-205},-24.895014193942188]
[null,{"$f":"'Contratos em Aberto DI'!A29","v":"V27"},{"$f":"VLOOKUP(MID(B31,1,1),Legendas!$B$8:$D$19,2,FALSE)","v":"Outubro"},{"$f":"WORKDAY(EOMONTH(\"15/\"&VLOOKUP(MID(B31,1,1),Legendas!$B$8:$D$19,3,FALSE)&\"/\"&\"20\"&RIGHT(B31,2),-1),1,Feriados!$A$2:$A$937)","v":"2027-10-01"},57837.377577493411,{"$f":"NETWORKDAYS('Curva de Juros Pré'!$B$1,D31,Feriados!$A$2:$A$937)-1","v":1242},{"$f":"InterpolaPre(F31)","v":0.11749999999999994},{"$f":"VLOOKUP(B31,'Contratos em Aberto DI'!$A$2:$C$40,2,FALSE)","v":16805},{"$f":"VLOOKUP(B31,'Contratos em Aberto DI'!$A$2:$C$40,3,FALSE)","v":50},-25.501570314299897]
[null,{"$f":"'Contratos em Aberto DI'!A30","v":"F28"},{"$f":"VLOOKUP(MID(B32,1,1),Legendas!$B$8:$D$19,2,FALSE)","v":"Janeiro"},{"$f":"WORKDAY(EOMONTH(\"15/\"&VLOOKUP(MID(B32,1,1),Legendas!$B$8:$D$19,3,FALSE)&\"/\"&\"20\"&RIGHT(B32,2),-1),1,Feriados!$A$2:$A$937)","v":"2028-01-03"},56201.02498717342,{"$f":"NETWORKDAYS('Curva de Juros Pré'!$B$1,D32,Feriados!$A$2:$A$937)-1","v":1305},{"$f":"InterpolaPre(F32)","v":0.11769999999999992},{"$f":"VLOOKUP(B32,'Contratos em Aberto DI'!$A$2:$C$40,2,FALSE)","v":94412},{"$f":"VLOOKUP(B32,'Contratos em Aberto DI'!$A$2:$C$40,3,FALSE)","v":-120},-26.032083448219055]
[null,{"$f":"'Contratos em Aberto DI'!A31","v":"F29"},{"$f":"VLOOKUP(MID(B33,1,1),Legendas!$B$8:$D$19,2,FALSE)","v":"Janeiro"},{"$f":"WORKDAY(EOMONTH(\"15/\"&VLOOKUP(MID(B33,1,1),Legendas!$B$8:$D$19,3,FALSE)&\"/\"&\"20\"&RIGHT(B33,2),-1),1,Feriados!$A$2:$A$937)","v":"2029-01-02"},50127.733809261583,{"$f":"NETWORKDAYS('Curva de Juros Pré'!$B$1,D33,Feriados!$A$2:$A$937)-1","v":1554},{"$f":"InterpolaPre(F33)","v":0.11850000000000005},{"$f":"VLOOKUP(B33,'Contratos em Aberto DI'!$A$2:$C$40,2,FALSE)","v":489507},{"$f":"VLOOKUP(B33,'Contratos em Aberto DI'!$A$2:$C$40,3,FALSE)","v":1890},-27.628253580107412]
[null,{"$f":"'Contratos em Aberto DI'!A32","v":"F30"},{"$f":"VLOOKUP(MID(B34,1,1),Legendas!$B$8:$D$19,2,FALSE)","v":"Janeiro"},{"$f":"WORKDAY(EOMONTH(\"15/\"&VLOOKUP(MID(B34,1,1),Legendas!$B$8:$D$19,3,FALSE)&\"/\"&\"20\"&RIGHT(B34,2),-1),1,Feriados!$A$2:$A$937)","v":"2030-01-02"},44742.107446603171,{"$f":"NETWORKDAYS('Curva de Juros Pré'!$B$1,D34,Feriados!$A$2:$A$937)-1","v":1804},{"$f":"InterpolaPre(F34)","v":0.11890000000000001},{"$f":"VLOOKUP(B34,'Contratos em Aberto DI'!$A$2:$C$40,2,FALSE)","v":51130},{"$f":"VLOOKUP(B34,'Contratos em Aberto DI'!$A$2:$C$40,3,FALSE)","v":15},-28.615598334261449]
[null,{"$f":"'Contratos em Aberto DI'!A33","v":"F31"},{"$f":"VLOOKUP(MID(B35,1,1),Legendas!$B$8:$D$19,2,FALSE)","v":"Janeiro"},{"$f":"WORKDAY(EOMONTH(\"15/\"&VLOOKUP(MID(B35,1,1),Legendas!$B$8:$D$19,3,FALSE)&\"/\"&\"20\"&RIGHT(B35,2),-1),1,Feriados!$A$2:$A$937)","v":"2031-01-02"},39824.263100829543,{"$f":"NETWORKDAYS('Curva de Juros Pré'!$B$1,D35,Feriados!$A$2:$A$937)-1","v":2057},{"$f":"InterpolaPre(F35)","v":0.11939999999999995},{"$f":"VLOOKUP(B35,'Contratos em Aberto DI'!$A$2:$C$40,2,FALSE)","v":330236},{"$f":"VLOOKUP(B35,'Contratos em Aberto DI'!$A$2:$C$40,3,FALSE)","v":1189},-29.028090691259422]
[null,{"$f":"'Contratos em Aberto DI'!A34","v":"F32"},{"$f":"VLOOKUP(MID(B36,1,1),Legendas!$B$8:$D$19,2,FALSE)","v":"Janeiro"},{"$f":"WORKDAY(EOMONTH(\"15/\"&VLOOKUP(MID(B36,1,1),Legendas!$B$8:$D$19,3,FALSE)&\"/\"&\"20\"&RIGHT(B36,2),-1),1,Feriados!$A$2:$A$937)","v":"2032-01-02"},35531.409488927362,{"$f":"NETWORKDAYS('Curva de Juros Pré'!$B$1,D36,Feriados!$A$2:$A$937)-1","v":2310},{"$f":"InterpolaPre(F36)","v":0.11949999999999994},{"$f":"VLOOKUP(B36,'Contratos em Aberto DI'!$A$2:$C$40,2,FALSE)","v":20370},{"$f":"VLOOKUP(B36,'Contratos em Aberto DI'!$A$2:$C$40,3,FALSE)","v":0},-29.080548717007332]
[null,{"$f":"'Contratos em Aberto DI'!A35","v":"F33"},{"$f":"VLOOKUP(MID(B37,1,1),Legendas!$B$8:$D$19,2,FALSE)","v":"Janeiro"},{"$f":"WORKDAY(EOMONTH(\"15/\"&VLOOKUP(MID(B37,1,1),Legendas!$B$8:$D$19,3,FALSE)&\"/\"&\"20\"&RIGHT(B37,2),-1),1,Feriados!$A$2:$A$937)","v":"2033-01-03"},31709.832922660196,{"$f":"NETWORKDAYS('Curva de Juros Pré'!$B$1,D37,Feriados!$A$2:$A$937)-1","v":2562},{"$f":"InterpolaPre(F37)","v":0.11959999999999993},{"$f":"VLOOKUP(B37,'Contratos em Aberto DI'!$A$2:$C$40,2,FALSE)","v":161994},{"$f":"VLOOKUP(B37,'Contratos em Aberto DI'!$A$2:$C$40,3,FALSE)","v":-205},-28.780152757037285]
[null,{"$f":"'Contratos em Aberto DI'!A36","v":"F34"},{"$f":"VLOOKUP(MID(B38,1,1),Legendas!$B$8:$D$19,2,FALSE)","v":"Janeiro"},{"$f":"WORKDAY(EOMONTH(\"15/\"&VLOOKUP(MID(B38,1,1),Legendas!$B$8:$D$19,3,FALSE)&\"/\"&\"20\"&RIGHT(B38,2),-1),1,Feriados!$A$2:$A$937)","v":"2034-01-02"},28250.551072585462,{"$f":"NETWORKDAYS('Curva de Juros Pré'!$B$1,D38,Feriados!$A$2:$A$937)-1","v":2813},{"$f":"InterpolaPre(F38)","v":0.1198999999999999},{"$f":"VLOOKUP(B38,'Contratos em Aberto DI'!$A$2:$C$40,2,FALSE)","v":1105},{"$f":"VLOOKUP(B38,'Contratos em Aberto DI'!$A$2:$C$40,3,FALSE)","v":0},-28.143691768342251]
[null,{"$f":"'Contratos em Aberto DI'!A37","v":"F35"},{"$f":"VLOOKUP(MID(B39,1,1),Legendas!$B$8:$D$19,2,FALSE)","v":"Janeiro"},{"$f":"WORKDAY(EOMONTH(\"15/\"&VLOOKUP(MID(B39,1,1),Legendas!$B$8:$D$19,3,FALSE)&\"/\"&\"20\"&RIGHT(B39,2),-1),1,Feriados!$A$2:$A$937)","v":"2035-01-02"},25287.411290276334,{"$f":"NETWORKDAYS('Curva de Juros Pré'!$B$1,D39,Feriados!$A$2:$A$937)-1","v":3062},{"$f":"InterpolaPre(F39)","v":0.11979999999999991},{"$f":"VLOOKUP(B39,'Contratos em Aberto DI'!$A$2:$C$40,2,FALSE)","v":3190},{"$f":"VLOOKUP(B39,'Contratos em Aberto DI'!$A$2:$C$40,3,FALSE)","v":0},-27.422912135803927]
[null,{"$f":"'Contratos em Aberto DI'!A38","v":"F36"},{"$f":"VLOOKUP(MID(B40,1,1),Legendas!$B$8:$D$19,2,FALSE)","v":"Janeiro"},{"$f":"WORKDAY(EOMONTH(\"15/\"&VLOOKUP(MID(B40,1,1),Legendas!$B$8:$D$19,3,FALSE)&\"/\"&\"20\"&RIGHT(B40,2),-1),1,Feriados!$A$2:$A$937)","v":"2036-01-02"},22602.366499395161,{"$f":"NETWORKDAYS('Curva de Juros Pré'!$B$1,D40,Feriados!$A$2:$A$937)-1","v":3312},{"$f":"InterpolaPre(F40)","v":0.11979999999999991},{"$f":"VLOOKUP(B40,'Contratos em Aberto DI'!$A$2:$C$40,2,FALSE)","v":19950},{"$f":"VLOOKUP(B40,'Contratos em Aberto DI'!$A$2:$C$40,3,FALSE)","v":0},-26.511177729251358]
[null,{"$f":"'Contratos em Aberto DI'!A39","v":"F37"},{"$f":"VLOOKUP(MID(B41,1,1),Legendas!$B$8:$D$19,2,FALSE)","v":"Janeiro"},{"$f":"WORKDAY(EOMONTH(\"15/\"&VLOOKUP(MID(B41,1,1),Legendas!$B$8:$D$19,3,FALSE)&\"/\"&\"20\"&RIGHT(B41,2),-1),1,Feriados!$A$2:$A$937)","v":"2037-01-02"},20166.171020604856,{"$f":"NETWORKDAYS('Curva de Juros Pré'!$B$1,D41,Feriados!$A$2:$A$937)-1","v":3566},{"$f":"InterpolaPre(F41)","v":0.11979999999999991},{"$f":"VLOOKUP(B41,'Contratos em Aberto DI'!$A$2:$C$40,2,FALSE)","v":800},{"$f":"VLOOKUP(B41,'Contratos em Aberto DI'!$A$2:$C$40,3,FALSE)","v":0},-25.466544731065369]

{"sheet":"Contratos em Aberto DI","index":1,"n_rows":39,"n_cols":5,"rows_kept":39,"cut":false,"hidden":false,"merged":[[0,0,0,2]]}
[null,null,null,"Site:","https://www.b3.com.br/pt_br/market-data-e-indices/servicos-de-dados/market-data/consultas/mercado-de-derivativos/contratos-em-aberto/vencimento-serie/contratos-em-aberto-futuro/"]
["X22",721057,-3770]
["Z22",447222,-1475]
["F23",5761509,23135]
["G23",170475,10770]
["H23",134242,335]
["J23",1115201,-19860]
["K23",95402,0]
["M23",49640,-40]
["N23",2497117,-6128]
["Q23",45660,0]
["U23",44090,-20]
["V23",395875,-5710]
["F24",4766724,-36613]
["J24",835139,4973]
["N24",934963,5506]
["V24",385270,525]
["F25",3239147,-25788]
["J25",90081,-30]
["N25",994265,-2810]
["V25",61492,-220]
["F26",1409237,3024]
["J26",36370,-120]
["N26",111945,-570]
["V26",52153,-95]
["F27",1043500,-22377]
["J27",25653,285]
["N27",23590,-205]
["V27",16805,50]
["F28",94412,-120]
["F29",489507,1890]
["F30",51130,15]
["F31",330236,1189]
["F32",20370,0]
["F33",161994,-205]
["F34",1105,0]
["F35",3190,0]
["F36",19950,0]
["F37",800,0]

{"sheet":"Curva de Juros Pré","index":2,"n_rows":270,"n_cols":3,"rows_kept":270,"cut":false,"hidden":false,"merged":[]}
["Data","2022-10-24","https://www.b3.com.br/pt_br/market-data-e-indices/servicos-de-dados/market-data/consultas/mercado-de-derivativos/precos-referenciais/taxas-referenciais-bm-fbovespa/"]
[]
["DC","DU","ETTJ Pré"]
[1,{"$f":"NETWORKDAYS($B$1,$B$1+A4,Feriados!$A$2:$A$937)-1","v":1},0.13650000000000001]
[4,{"$f":"NETWORKDAYS($B$1,$B$1+A5,Feriados!$A$2:$A$937)-1","v":4},0.13650000000000001]
[7,{"$f":"NETWORKDAYS($B$1,$B$1+A6,Feriados!$A$2:$A$937)-1","v":5},0.13650000000000001]
[8,{"$f":"NETWORKDAYS($B$1,$B$1+A7,Feriados!$A$2:$A$937)-1","v":6},0.13650000000000001]
[14,{"$f":"NETWORKDAYS($B$1,$B$1+A8,Feriados!$A$2:$A$937)-1","v":9},0.1366]
[21,{"$f":"NETWORKDAYS($B$1,$B$1+A9,Feriados!$A$2:$A$937)-1","v":14},0.13669999999999999]
[23,{"$f":"NETWORKDAYS($B$1,$B$1+A10,Feriados!$A$2:$A$937)-1","v":15},0.13669999999999999]
[25,{"$f":"NETWORKDAYS($B$1,$B$1+A11,Feriados!$A$2:$A$937)-1","v":17},0.13669999999999999]
[30,{"$f":"NETWORKDAYS($B$1,$B$1+A12,Feriados!$A$2:$A$937)-1","v":20},0.13669999999999999]
[35,{"$f":"NETWORKDAYS($B$1,$B$1+A13,Feriados!$A$2:$A$937)-1","v":23},0.13669999999999999]
[36,{"$f":"NETWORKDAYS($B$1,$B$1+A14,Feriados!$A$2:$A$937)-1","v":24},0.13669999999999999]
[37,{"$f":"NETWORKDAYS($B$1,$B$1+A15,Feriados!$A$2:$A$937)-1","v":25},0.13669999999999999]
[38,{"$f":"NETWORKDAYS($B$1,$B$1+A16,Feriados!$A$2:$A$937)-1","v":26},0.13669999999999999]
[46,{"$f":"NETWORKDAYS($B$1,$B$1+A17,Feriados!$A$2:$A$937)-1","v":32},0.1368]
[51,{"$f":"NETWORKDAYS($B$1,$B$1+A18,Feriados!$A$2:$A$937)-1","v":35},0.1368]
[52,{"$f":"NETWORKDAYS($B$1,$B$1+A19,Feriados!$A$2:$A$937)-1","v":36},0.1368]
[53,{"$f":"NETWORKDAYS($B$1,$B$1+A20,Feriados!$A$2:$A$937)-1","v":37},0.1368]
[58,{"$f":"NETWORKDAYS($B$1,$B$1+A21,Feriados!$A$2:$A$937)-1","v":40},0.1368]
[60,{"$f":"NETWORKDAYS($B$1,$B$1+A22,Feriados!$A$2:$A$937)-1","v":42},0.1368]
[65,{"$f":"NETWORKDAYS($B$1,$B$1+A23,Feriados!$A$2:$A$937)-1","v":45},0.13689999999999999]
[66,{"$f":"NETWORKDAYS($B$1,$B$1+A24,Feriados!$A$2:$A$937)-1","v":46},0.13689999999999999]
[70,{"$f":"NETWORKDAYS($B$1,$B$1+A25,Feriados!$A$2:$A$937)-1","v":48},0.13689999999999999]
[84,{"$f":"NETWORKDAYS($B$1,$B$1+A26,Feriados!$A$2:$A$937)-1","v":58},0.13689999999999999]
[86,{"$f":"NETWORKDAYS($B$1,$B$1+A27,Feriados!$A$2:$A$937)-1","v":60},0.13689999999999999]
[91,{"$f":"NETWORKDAYS($B$1,$B$1+A28,Feriados!$A$2:$A$937)-1","v":63},0.13689999999999999]
[99,{"$f":"NETWORKDAYS($B$1,$B$1+A29,Feriados!$A$2:$A$937)-1","v":69},0.13689999999999999]
[100,{"$f":"NETWORKDAYS($B$1,$B$1+A30,Feriados!$A$2:$A$937)-1","v":70},0.13689999999999999]
[114,{"$f":"NETWORKDAYS($B$1,$B$1+A31,Feriados!$A$2:$A$937)-1","v":80},0.13689999999999999]
[115,{"$f":"NETWORKDAYS($B$1,$B$1+A32,Feriados!$A$2:$A$937)-1","v":81},0.13689999999999999]
[121,{"$f":"NETWORKDAYS($B$1,$B$1+A33,Feriados!$A$2:$A$937)-1","v":83},0.13689999999999999]
[126,{"$f":"NETWORKDAYS($B$1,$B$1+A34,Feriados!$A$2:$A$937)-1","v":86},0.13699999999999998]
[127,{"$f":"NETWORKDAYS($B$1,$B$1+A35,Feriados!$A$2:$A$937)-1","v":87},0.13699999999999998]
[128,{"$f":"NETWORKDAYS($B$1,$B$1+A36,Feriados!$A$2:$A$937)-1","v":88},0.13699999999999998]
[137,{"$f":"NETWORKDAYS($B$1,$B$1+A37,Feriados!$A$2:$A$937)-1","v":95},0.13699999999999998]
[142,{"$f":"NETWORKDAYS($B$1,$B$1+A38,Feriados!$A$2:$A$937)-1","v":98},0.13699999999999998]
[143,{"$f":"NETWORKDAYS($B$1,$B$1+A39,Feriados!$A$2:$A$937)-1","v":99},0.13699999999999998]
[144,{"$f":"NETWORKDAYS($B$1,$B$1+A40,Feriados!$A$2:$A$937)-1","v":100},0.13699999999999998]
[150,{"$f":"NETWORKDAYS($B$1,$B$1+A41,Feriados!$A$2:$A$937)-1","v":104},0.13699999999999998]
[158,{"$f":"NETWORKDAYS($B$1,$B$1+A42,Feriados!$A$2:$A$937)-1","v":110},0.13699999999999998]
[161,{"$f":"NETWORKDAYS($B$1,$B$1+A43,Feriados!$A$2:$A$937)-1","v":111},0.13699999999999998]
[170,{"$f":"NETWORKDAYS($B$1,$B$1+A44,Feriados!$A$2:$A$937)-1","v":117},0.13689999999999999]
[175,{"$f":"NETWORKDAYS($B$1,$B$1+A45,Feriados!$A$2:$A$937)-1","v":120},0.13689999999999999]
[182,{"$f":"NETWORKDAYS($B$1,$B$1+A46,Feriados!$A$2:$A$937)-1","v":124},0.1368]
[185,{"$f":"NETWORKDAYS($B$1,$B$1+A47,Feriados!$A$2:$A$937)-1","v":127},0.1368]
[186,{"$f":"NETWORKDAYS($B$1,$B$1+A48,Feriados!$A$2:$A$937)-1","v":128},0.1368]
[190,{"$f":"NETWORKDAYS($B$1,$B$1+A49,Feriados!$A$2:$A$937)-1","v":129},0.1368]
[203,{"$f":"NETWORKDAYS($B$1,$B$1+A50,Feriados!$A$2:$A$937)-1","v":138},0.1366]
[210,{"$f":"NETWORKDAYS($B$1,$B$1+A51,Feriados!$A$2:$A$937)-1","v":143},0.13639999999999999]
[211,{"$f":"NETWORKDAYS($B$1,$B$1+A52,Feriados!$A$2:$A$937)-1","v":144},0.13639999999999999]
[219,{"$f":"NETWORKDAYS($B$1,$B$1+A53,Feriados!$A$2:$A$937)-1","v":150},0.1363]
[220,{"$f":"NETWORKDAYS($B$1,$B$1+A54,Feriados!$A$2:$A$937)-1","v":151},0.1363]
[233,{"$f":"NETWORKDAYS($B$1,$B$1+A55,Feriados!$A$2:$A$937)-1","v":159},0.13589999999999999]
[234,{"$f":"NETWORKDAYS($B$1,$B$1+A56,Feriados!$A$2:$A$937)-1","v":160},0.13589999999999999]
[235,{"$f":"NETWORKDAYS($B$1,$B$1+A57,Feriados!$A$2:$A$937)-1","v":161},0.1358]
[240,{"$f":"NETWORKDAYS($B$1,$B$1+A58,Feriados!$A$2:$A$937)-1","v":164},0.13570000000000002]
[248,{"$f":"NETWORKDAYS($B$1,$B$1+A59,Feriados!$A$2:$A$937)-1","v":170},0.13539999999999999]
[249,{"$f":"NETWORKDAYS($B$1,$B$1+A60,Feriados!$A$2:$A$937)-1","v":171},0.13539999999999999]
[252,{"$f":"NETWORKDAYS($B$1,$B$1+A61,Feriados!$A$2:$A$937)-1","v":172},0.13539999999999999]
[261,{"$f":"NETWORKDAYS($B$1,$B$1+A62,Feriados!$A$2:$A$937)-1","v":179},0.13500000000000001]
[266,{"$f":"NETWORKDAYS($B$1,$B$1+A63,Feriados!$A$2:$A$937)-1","v":182},0.13489999999999999]
[270,{"$f":"NETWORKDAYS($B$1,$B$1+A64,Feriados!$A$2:$A$937)-1","v":186},0.13470000000000001]
[277,{"$f":"NETWORKDAYS($B$1,$B$1+A65,Feriados!$A$2:$A$937)-1","v":191},0.13449999999999998]
[280,{"$f":"NETWORKDAYS($B$1,$B$1+A66,Feriados!$A$2:$A$937)-1","v":192},0.13449999999999998]
[281,{"$f":"NETWORKDAYS($B$1,$B$1+A67,Feriados!$A$2:$A$937)-1","v":193},0.13449999999999998]
[295,{"$f":"NETWORKDAYS($B$1,$B$1+A68,Feriados!$A$2:$A$937)-1","v":203},0.13400000000000001]
[296,{"$f":"NETWORKDAYS($B$1,$B$1+A69,Feriados!$A$2:$A$937)-1","v":204},0.13390000000000002]
[301,{"$f":"NETWORKDAYS($B$1,$B$1+A70,Feriados!$A$2:$A$937)-1","v":207},0.1338]
[310,{"$f":"NETWORKDAYS($B$1,$B$1+A71,Feriados!$A$2:$A$937)-1","v":214},0.13350000000000001]
[312,{"$f":"NETWORKDAYS($B$1,$B$1+A72,Feriados!$A$2:$A$937)-1","v":216},0.13339999999999999]
[326,{"$f":"NETWORKDAYS($B$1,$B$1+A73,Feriados!$A$2:$A$937)-1","v":225},0.13289999999999999]
[330,{"$f":"NETWORKDAYS($B$1,$B$1+A74,Feriados!$A$2:$A$937)-1","v":227},0.1328]
[332,{"$f":"NETWORKDAYS($B$1,$B$1+A75,Feriados!$A$2:$A$937)-1","v":229},0.13269999999999998]
[336,{"$f":"NETWORKDAYS($B$1,$B$1+A76,Feriados!$A$2:$A$937)-1","v":231},0.1326]
[343,{"$f":"NETWORKDAYS($B$1,$B$1+A77,Feriados!$A$2:$A$937)-1","v":236},0.13239999999999999]
[357,{"$f":"NETWORKDAYS($B$1,$B$1+A78,Feriados!$A$2:$A$937)-1","v":245},0.1318]
[359,{"$f":"NETWORKDAYS($B$1,$B$1+A79,Feriados!$A$2:$A$937)-1","v":247},0.13159999999999999]
[360,{"$f":"NETWORKDAYS($B$1,$B$1+A80,Feriados!$A$2:$A$937)-1","v":248},0.13150000000000001]
[372,{"$f":"NETWORKDAYS($B$1,$B$1+A81,Feriados!$A$2:$A$937)-1","v":256},0.13100000000000001]
[388,{"$f":"NETWORKDAYS($B$1,$B$1+A82,Feriados!$A$2:$A$937)-1","v":266},0.13039999999999999]
[392,{"$f":"NETWORKDAYS($B$1,$B$1+A83,Feriados!$A$2:$A$937)-1","v":268},0.1303]
[415,{"$f":"NETWORKDAYS($B$1,$B$1+A84,Feriados!$A$2:$A$937)-1","v":285},0.1293]
[420,{"$f":"NETWORKDAYS($B$1,$B$1+A85,Feriados!$A$2:$A$937)-1","v":288},0.12920000000000001]
[421,{"$f":"NETWORKDAYS($B$1,$B$1+A86,Feriados!$A$2:$A$937)-1","v":289},0.12909999999999999]
[435,{"$f":"NETWORKDAYS($B$1,$B$1+A87,Feriados!$A$2:$A$937)-1","v":297},0.1288]
[448,{"$f":"NETWORKDAYS($B$1,$B$1+A88,Feriados!$A$2:$A$937)-1","v":306},0.12820000000000001]
[450,{"$f":"NETWORKDAYS($B$1,$B$1+A89,Feriados!$A$2:$A$937)-1","v":308},0.12809999999999999]
[478,{"$f":"NETWORKDAYS($B$1,$B$1+A90,Feriados!$A$2:$A$937)-1","v":326},0.127]
[479,{"$f":"NETWORKDAYS($B$1,$B$1+A91,Feriados!$A$2:$A$937)-1","v":327},0.127]
[480,{"$f":"NETWORKDAYS($B$1,$B$1+A92,Feriados!$A$2:$A$937)-1","v":328},0.12689999999999999]
[506,{"$f":"NETWORKDAYS($B$1,$B$1+A93,Feriados!$A$2:$A$937)-1","v":346},0.126]
[511,{"$f":"NETWORKDAYS($B$1,$B$1+A94,Feriados!$A$2:$A$937)-1","v":349},0.12590000000000001]
[513,{"$f":"NETWORKDAYS($B$1,$B$1+A95,Feriados!$A$2:$A$937)-1","v":351},0.1258]
[525,{"$f":"NETWORKDAYS($B$1,$B$1+A96,Feriados!$A$2:$A$937)-1","v":358},0.1255]
[539,{"$f":"NETWORKDAYS($B$1,$B$1+A97,Feriados!$A$2:$A$937)-1","v":368},0.1249]
[540,{"$f":"NETWORKDAYS($B$1,$B$1+A98,Feriados!$A$2:$A$937)-1","v":369},0.12480000000000001]
[541,{"$f":"NETWORKDAYS($B$1,$B$1+A99,Feriados!$A$2:$A$937)-1","v":370},0.12470000000000001]
[553,{"$f":"NETWORKDAYS($B$1,$B$1+A100,Feriados!$A$2:$A$937)-1","v":378},0.12429999999999999]
[569,{"$f":"NETWORKDAYS($B$1,$B$1+A101,Feriados!$A$2:$A$937)-1","v":389},0.12369999999999999]
[570,{"$f":"NETWORKDAYS($B$1,$B$1+A102,Feriados!$A$2:$A$937)-1","v":390},0.12369999999999999]
[576,{"$f":"NETWORKDAYS($B$1,$B$1+A103,Feriados!$A$2:$A$937)-1","v":394},0.1235]
[597,{"$f":"NETWORKDAYS($B$1,$B$1+A104,Feriados!$A$2:$A$937)-1","v":408},0.12279999999999999]
[602,{"$f":"NETWORKDAYS($B$1,$B$1+A105,Feriados!$A$2:$A$937)-1","v":411},0.12269999999999999]
[616,{"$f":"NETWORKDAYS($B$1,$B$1+A106,Feriados!$A$2:$A$937)-1","v":421},0.1222]
[630,{"$f":"NETWORKDAYS($B$1,$B$1+A107,Feriados!$A$2:$A$937)-1","v":431},0.12179999999999999]
[660,{"$f":"NETWORKDAYS($B$1,$B$1+A108,Feriados!$A$2:$A$937)-1","v":453},0.12089999999999999]
[661,{"$f":"NETWORKDAYS($B$1,$B$1+A109,Feriados!$A$2:$A$937)-1","v":454},0.12089999999999999]
[690,{"$f":"NETWORKDAYS($B$1,$B$1+A110,Feriados!$A$2:$A$937)-1","v":475},0.1201]
[708,{"$f":"NETWORKDAYS($B$1,$B$1+A111,Feriados!$A$2:$A$937)-1","v":487},0.1198]
[717,{"$f":"NETWORKDAYS($B$1,$B$1+A112,Feriados!$A$2:$A$937)-1","v":494},0.11960000000000001]
[721,{"$f":"NETWORKDAYS($B$1,$B$1+A113,Feriados!$A$2:$A$937)-1","v":496},0.1195]
[723,{"$f":"NETWORKDAYS($B$1,$B$1+A114,Feriados!$A$2:$A$937)-1","v":498},0.1195]
[750,{"$f":"NETWORKDAYS($B$1,$B$1+A115,Feriados!$A$2:$A$937)-1","v":517},0.11900000000000001]
[756,{"$f":"NETWORKDAYS($B$1,$B$1+A116,Feriados!$A$2:$A$937)-1","v":520},0.11890000000000001]
[780,{"$f":"NETWORKDAYS($B$1,$B$1+A117,Feriados!$A$2:$A$937)-1","v":538},0.11849999999999999]
[801,{"$f":"NETWORKDAYS($B$1,$B$1+A118,Feriados!$A$2:$A$937)-1","v":551},0.1182]
[812,{"$f":"NETWORKDAYS($B$1,$B$1+A119,Feriados!$A$2:$A$937)-1","v":558},0.11810000000000001]
[840,{"$f":"NETWORKDAYS($B$1,$B$1+A120,Feriados!$A$2:$A$937)-1","v":578},0.11779999999999999]
[847,{"$f":"NETWORKDAYS($B$1,$B$1+A121,Feriados!$A$2:$A$937)-1","v":583},0.1177]
[870,{"$f":"NETWORKDAYS($B$1,$B$1+A122,Feriados!$A$2:$A$937)-1","v":598},0.11749999999999999]
[890,{"$f":"NETWORKDAYS($B$1,$B$1+A123,Feriados!$A$2:$A$937)-1","v":612},0.1173]
[900,{"$f":"NETWORKDAYS($B$1,$B$1+A124,Feriados!$A$2:$A$937)-1","v":620},0.11720000000000001]
[921,{"$f":"NETWORKDAYS($B$1,$B$1+A125,Feriados!$A$2:$A$937)-1","v":632},0.11710000000000001]
[931,{"$f":"NETWORKDAYS($B$1,$B$1+A126,Feriados!$A$2:$A$937)-1","v":638},0.11710000000000001]
[934,{"$f":"NETWORKDAYS($B$1,$B$1+A127,Feriados!$A$2:$A$937)-1","v":641},0.11710000000000001]
[960,{"$f":"NETWORKDAYS($B$1,$B$1+A128,Feriados!$A$2:$A$937)-1","v":659},0.11699999999999999]
[981,{"$f":"NETWORKDAYS($B$1,$B$1+A129,Feriados!$A$2:$A$937)-1","v":673},0.11689999999999999]
[990,{"$f":"NETWORKDAYS($B$1,$B$1+A130,Feriados!$A$2:$A$937)-1","v":680},0.11689999999999999]
[1022,{"$f":"NETWORKDAYS($B$1,$B$1+A131,Feriados!$A$2:$A$937)-1","v":702},0.11699999999999999]
[1026,{"$f":"NETWORKDAYS($B$1,$B$1+A132,Feriados!$A$2:$A$937)-1","v":706},0.11710000000000001]
[1050,{"$f":"NETWORKDAYS($B$1,$B$1+A133,Feriados!$A$2:$A$937)-1","v":722},0.11710000000000001]
[1073,{"$f":"NETWORKDAYS($B$1,$B$1+A134,Feriados!$A$2:$A$937)-1","v":739},0.11720000000000001]
[1080,{"$f":"NETWORKDAYS($B$1,$B$1+A135,Feriados!$A$2:$A$937)-1","v":744},0.11720000000000001]
[1110,{"$f":"NETWORKDAYS($B$1,$B$1+A136,Feriados!$A$2:$A$937)-1","v":766},0.11710000000000001]
[1120,{"$f":"NETWORKDAYS($B$1,$B$1+A137,Feriados!$A$2:$A$937)-1","v":772},0.11699999999999999]
[1141,{"$f":"NETWORKDAYS($B$1,$B$1+A138,Feriados!$A$2:$A$937)-1","v":787},0.11699999999999999]
[1166,{"$f":"NETWORKDAYS($B$1,$B$1+A139,Feriados!$A$2:$A$937)-1","v":804},0.11689999999999999]
[1170,{"$f":"NETWORKDAYS($B$1,$B$1+A140,Feriados!$A$2:$A$937)-1","v":806},0.11689999999999999]
[1200,{"$f":"NETWORKDAYS($B$1,$B$1+A141,Feriados!$A$2:$A$937)-1","v":828},0.11699999999999999]
[1213,{"$f":"NETWORKDAYS($B$1,$B$1+A142,Feriados!$A$2:$A$937)-1","v":835},0.11710000000000001]
[1255,{"$f":"NETWORKDAYS($B$1,$B$1+A143,Feriados!$A$2:$A$937)-1","v":865},0.11720000000000001]
[1299,{"$f":"NETWORKDAYS($B$1,$B$1+A144,Feriados!$A$2:$A$937)-1","v":894},0.11720000000000001]
[1346,{"$f":"NETWORKDAYS($B$1,$B$1+A145,Feriados!$A$2:$A$937)-1","v":926},0.11720000000000001]
[1393,{"$f":"NETWORKDAYS($B$1,$B$1+A146,Feriados!$A$2:$A$937)-1","v":959},0.11720000000000001]
[1438,{"$f":"NETWORKDAYS($B$1,$B$1+A147,Feriados!$A$2:$A$937)-1","v":991},0.1173]
[1442,{"$f":"NETWORKDAYS($B$1,$B$1+A148,Feriados!$A$2:$A$937)-1","v":993},0.1173]
[1484,{"$f":"NETWORKDAYS($B$1,$B$1+A149,Feriados!$A$2:$A$937)-1","v":1021},0.11720000000000001]
[1533,{"$f":"NETWORKDAYS($B$1,$B$1+A150,Feriados!$A$2:$A$937)-1","v":1054},0.11710000000000001]
[1575,{"$f":"NETWORKDAYS($B$1,$B$1+A151,Feriados!$A$2:$A$937)-1","v":1082},0.11720000000000001]
[1620,{"$f":"NETWORKDAYS($B$1,$B$1+A152,Feriados!$A$2:$A$937)-1","v":1114},0.11720000000000001]
[1666,{"$f":"NETWORKDAYS($B$1,$B$1+A153,Feriados!$A$2:$A$937)-1","v":1145},0.1173]
[1711,{"$f":"NETWORKDAYS($B$1,$B$1+A154,Feriados!$A$2:$A$937)-1","v":1177},0.1173]
[1757,{"$f":"NETWORKDAYS($B$1,$B$1+A155,Feriados!$A$2:$A$937)-1","v":1209},0.1174]
[1800,{"$f":"NETWORKDAYS($B$1,$B$1+A156,Feriados!$A$2:$A$937)-1","v":1239},0.11749999999999999]
[1803,{"$f":"NETWORKDAYS($B$1,$B$1+A157,Feriados!$A$2:$A$937)-1","v":1242},0.11749999999999999]
[1849,{"$f":"NETWORKDAYS($B$1,$B$1+A158,Feriados!$A$2:$A$937)-1","v":1271},0.1176]
[1897,{"$f":"NETWORKDAYS($B$1,$B$1+A159,Feriados!$A$2:$A$937)-1","v":1305},0.1177]
[1940,{"$f":"NETWORKDAYS($B$1,$B$1+A160,Feriados!$A$2:$A$937)-1","v":1336},0.11779999999999999]
[2030,{"$f":"NETWORKDAYS($B$1,$B$1+A161,Feriados!$A$2:$A$937)-1","v":1395},0.11800000000000001]
[2079,{"$f":"NETWORKDAYS($B$1,$B$1+A162,Feriados!$A$2:$A$937)-1","v":1429},0.11810000000000001]
[2122,{"$f":"NETWORKDAYS($B$1,$B$1+A163,Feriados!$A$2:$A$937)-1","v":1460},0.1182]
[2160,{"$f":"NETWORKDAYS($B$1,$B$1+A164,Feriados!$A$2:$A$937)-1","v":1487},0.1183]
[2215,{"$f":"NETWORKDAYS($B$1,$B$1+A165,Feriados!$A$2:$A$937)-1","v":1523},0.11840000000000001]
[2262,{"$f":"NETWORKDAYS($B$1,$B$1+A166,Feriados!$A$2:$A$937)-1","v":1554},0.11849999999999999]
[2306,{"$f":"NETWORKDAYS($B$1,$B$1+A167,Feriados!$A$2:$A$937)-1","v":1584},0.1186]
[2395,{"$f":"NETWORKDAYS($B$1,$B$1+A168,Feriados!$A$2:$A$937)-1","v":1645},0.1186]
[2443,{"$f":"NETWORKDAYS($B$1,$B$1+A169,Feriados!$A$2:$A$937)-1","v":1678},0.11869999999999999]
[2473,{"$f":"NETWORKDAYS($B$1,$B$1+A170,Feriados!$A$2:$A$937)-1","v":1700},0.11869999999999999]
[2487,{"$f":"NETWORKDAYS($B$1,$B$1+A171,Feriados!$A$2:$A$937)-1","v":1710},0.11869999999999999]
[2520,{"$f":"NETWORKDAYS($B$1,$B$1+A172,Feriados!$A$2:$A$937)-1","v":1732},0.1188]
[2580,{"$f":"NETWORKDAYS($B$1,$B$1+A173,Feriados!$A$2:$A$937)-1","v":1773},0.1188]
[2627,{"$f":"NETWORKDAYS($B$1,$B$1+A174,Feriados!$A$2:$A$937)-1","v":1804},0.11890000000000001]
[2671,{"$f":"NETWORKDAYS($B$1,$B$1+A175,Feriados!$A$2:$A$937)-1","v":1836},0.11890000000000001]
[2716,{"$f":"NETWORKDAYS($B$1,$B$1+A176,Feriados!$A$2:$A$937)-1","v":1865},0.11900000000000001]
[2760,{"$f":"NETWORKDAYS($B$1,$B$1+A177,Feriados!$A$2:$A$937)-1","v":1895},0.1191]
[2807,{"$f":"NETWORKDAYS($B$1,$B$1+A178,Feriados!$A$2:$A$937)-1","v":1927},0.1191]
[2852,{"$f":"NETWORKDAYS($B$1,$B$1+A179,Feriados!$A$2:$A$937)-1","v":1960},0.1192]
[2880,{"$f":"NETWORKDAYS($B$1,$B$1+A180,Feriados!$A$2:$A$937)-1","v":1980},0.1193]
[2947,{"$f":"NETWORKDAYS($B$1,$B$1+A181,Feriados!$A$2:$A$937)-1","v":2026},0.1193]
[2992,{"$f":"NETWORKDAYS($B$1,$B$1+A182,Feriados!$A$2:$A$937)-1","v":2057},0.11939999999999999]
[3038,{"$f":"NETWORKDAYS($B$1,$B$1+A183,Feriados!$A$2:$A$937)-1","v":2089},0.11939999999999999]
[3125,{"$f":"NETWORKDAYS($B$1,$B$1+A184,Feriados!$A$2:$A$937)-1","v":2147},0.11939999999999999]
[3217,{"$f":"NETWORKDAYS($B$1,$B$1+A185,Feriados!$A$2:$A$937)-1","v":2212},0.1195]
[3241,{"$f":"NETWORKDAYS($B$1,$B$1+A186,Feriados!$A$2:$A$937)-1","v":2228},0.1195]
[3311,{"$f":"NETWORKDAYS($B$1,$B$1+A187,Feriados!$A$2:$A$937)-1","v":2278},0.1195]
[3357,{"$f":"NETWORKDAYS($B$1,$B$1+A188,Feriados!$A$2:$A$937)-1","v":2310},0.1195]
[3402,{"$f":"NETWORKDAYS($B$1,$B$1+A189,Feriados!$A$2:$A$937)-1","v":2339},0.1195]
[3493,{"$f":"NETWORKDAYS($B$1,$B$1+A190,Feriados!$A$2:$A$937)-1","v":2402},0.1195]
[3584,{"$f":"NETWORKDAYS($B$1,$B$1+A191,Feriados!$A$2:$A$937)-1","v":2466},0.11960000000000001]
[3600,{"$f":"NETWORKDAYS($B$1,$B$1+A192,Feriados!$A$2:$A$937)-1","v":2478},0.11960000000000001]
[3676,{"$f":"NETWORKDAYS($B$1,$B$1+A193,Feriados!$A$2:$A$937)-1","v":2528},0.11960000000000001]
[3724,{"$f":"NETWORKDAYS($B$1,$B$1+A194,Feriados!$A$2:$A$937)-1","v":2562},0.11960000000000001]
[3767,{"$f":"NETWORKDAYS($B$1,$B$1+A195,Feriados!$A$2:$A$937)-1","v":2593},0.11960000000000001]
[3857,{"$f":"NETWORKDAYS($B$1,$B$1+A196,Feriados!$A$2:$A$937)-1","v":2653},0.1197]
[3948,{"$f":"NETWORKDAYS($B$1,$B$1+A197,Feriados!$A$2:$A$937)-1","v":2717},0.1198]
[3962,{"$f":"NETWORKDAYS($B$1,$B$1+A198,Feriados!$A$2:$A$937)-1","v":2727},0.1198]
[4041,{"$f":"NETWORKDAYS($B$1,$B$1+A199,Feriados!$A$2:$A$937)-1","v":2780},0.1198]
[4088,{"$f":"NETWORKDAYS($B$1,$B$1+A200,Feriados!$A$2:$A$937)-1","v":2813},0.11990000000000001]
[4132,{"$f":"NETWORKDAYS($B$1,$B$1+A201,Feriados!$A$2:$A$937)-1","v":2845},0.1198]
[4221,{"$f":"NETWORKDAYS($B$1,$B$1+A202,Feriados!$A$2:$A$937)-1","v":2903},0.1198]
[4313,{"$f":"NETWORKDAYS($B$1,$B$1+A203,Feriados!$A$2:$A$937)-1","v":2968},0.1198]
[4320,{"$f":"NETWORKDAYS($B$1,$B$1+A204,Feriados!$A$2:$A$937)-1","v":2973},0.1198]
[4406,{"$f":"NETWORKDAYS($B$1,$B$1+A205,Feriados!$A$2:$A$937)-1","v":3031},0.1198]
[4453,{"$f":"NETWORKDAYS($B$1,$B$1+A206,Feriados!$A$2:$A$937)-1","v":3062},0.1198]
[4497,{"$f":"NETWORKDAYS($B$1,$B$1+A207,Feriados!$A$2:$A$937)-1","v":3092},0.1198]
[4586,{"$f":"NETWORKDAYS($B$1,$B$1+A208,Feriados!$A$2:$A$937)-1","v":3153},0.1198]
[4678,{"$f":"NETWORKDAYS($B$1,$B$1+A209,Feriados!$A$2:$A$937)-1","v":3218},0.1198]
[4680,{"$f":"NETWORKDAYS($B$1,$B$1+A210,Feriados!$A$2:$A$937)-1","v":3220},0.1198]
[4771,{"$f":"NETWORKDAYS($B$1,$B$1+A211,Feriados!$A$2:$A$937)-1","v":3281},0.1198]
[4818,{"$f":"NETWORKDAYS($B$1,$B$1+A212,Feriados!$A$2:$A$937)-1","v":3312},0.1198]
[4862,{"$f":"NETWORKDAYS($B$1,$B$1+A213,Feriados!$A$2:$A$937)-1","v":3344},0.1198]
[4952,{"$f":"NETWORKDAYS($B$1,$B$1+A214,Feriados!$A$2:$A$937)-1","v":3403},0.1198]
[5040,{"$f":"NETWORKDAYS($B$1,$B$1+A215,Feriados!$A$2:$A$937)-1","v":3464},0.1198]
[5044,{"$f":"NETWORKDAYS($B$1,$B$1+A216,Feriados!$A$2:$A$937)-1","v":3468},0.1198]
[5138,{"$f":"NETWORKDAYS($B$1,$B$1+A217,Feriados!$A$2:$A$937)-1","v":3534},0.1198]
[5184,{"$f":"NETWORKDAYS($B$1,$B$1+A218,Feriados!$A$2:$A$937)-1","v":3566},0.1198]
[5231,{"$f":"NETWORKDAYS($B$1,$B$1+A219,Feriados!$A$2:$A$937)-1","v":3597},0.1198]
[5317,{"$f":"NETWORKDAYS($B$1,$B$1+A220,Feriados!$A$2:$A$937)-1","v":3656},0.1198]
[5400,{"$f":"NETWORKDAYS($B$1,$B$1+A221,Feriados!$A$2:$A$937)-1","v":3714},0.1198]
[5411,{"$f":"NETWORKDAYS($B$1,$B$1+A222,Feriados!$A$2:$A$937)-1","v":3721},0.1198]
[5502,{"$f":"NETWORKDAYS($B$1,$B$1+A223,Feriados!$A$2:$A$937)-1","v":3783},0.1198]
[5580,{"$f":"NETWORKDAYS($B$1,$B$1+A224,Feriados!$A$2:$A$937)-1","v":3837},0.1198]
[5593,{"$f":"NETWORKDAYS($B$1,$B$1+A225,Feriados!$A$2:$A$937)-1","v":3846},0.1198]
[5684,{"$f":"NETWORKDAYS($B$1,$B$1+A226,Feriados!$A$2:$A$937)-1","v":3907},0.1198]
[5775,{"$f":"NETWORKDAYS($B$1,$B$1+A227,Feriados!$A$2:$A$937)-1","v":3971},0.1198]
[5867,{"$f":"NETWORKDAYS($B$1,$B$1+A228,Feriados!$A$2:$A$937)-1","v":4033},0.1198]
[5958,{"$f":"NETWORKDAYS($B$1,$B$1+A229,Feriados!$A$2:$A$937)-1","v":4098},0.1198]
[6048,{"$f":"NETWORKDAYS($B$1,$B$1+A230,Feriados!$A$2:$A$937)-1","v":4158},0.1198]
[6139,{"$f":"NETWORKDAYS($B$1,$B$1+A231,Feriados!$A$2:$A$937)-1","v":4222},0.1198]
[6232,{"$f":"NETWORKDAYS($B$1,$B$1+A232,Feriados!$A$2:$A$937)-1","v":4285},0.1198]
[6323,{"$f":"NETWORKDAYS($B$1,$B$1+A233,Feriados!$A$2:$A$937)-1","v":4348},0.1198]
[6413,{"$f":"NETWORKDAYS($B$1,$B$1+A234,Feriados!$A$2:$A$937)-1","v":4410},0.1198]
[6505,{"$f":"NETWORKDAYS($B$1,$B$1+A235,Feriados!$A$2:$A$937)-1","v":4475},0.1198]
[6598,{"$f":"NETWORKDAYS($B$1,$B$1+A236,Feriados!$A$2:$A$937)-1","v":4538},0.1198]
[6689,{"$f":"NETWORKDAYS($B$1,$B$1+A237,Feriados!$A$2:$A$937)-1","v":4601},0.1198]
[6778,{"$f":"NETWORKDAYS($B$1,$B$1+A238,Feriados!$A$2:$A$937)-1","v":4660},0.1198]
[6870,{"$f":"NETWORKDAYS($B$1,$B$1+A239,Feriados!$A$2:$A$937)-1","v":4725},0.1198]
[6965,{"$f":"NETWORKDAYS($B$1,$B$1+A240,Feriados!$A$2:$A$937)-1","v":4791},0.1198]
[7058,{"$f":"NETWORKDAYS($B$1,$B$1+A241,Feriados!$A$2:$A$937)-1","v":4854},0.1198]
[7143,{"$f":"NETWORKDAYS($B$1,$B$1+A242,Feriados!$A$2:$A$937)-1","v":4912},0.1198]
[7200,{"$f":"NETWORKDAYS($B$1,$B$1+A243,Feriados!$A$2:$A$937)-1","v":4952},0.1198]
[7235,{"$f":"NETWORKDAYS($B$1,$B$1+A244,Feriados!$A$2:$A$937)-1","v":4977},0.1198]
[7329,{"$f":"NETWORKDAYS($B$1,$B$1+A245,Feriados!$A$2:$A$937)-1","v":5043},0.1198]
[7420,{"$f":"NETWORKDAYS($B$1,$B$1+A246,Feriados!$A$2:$A$937)-1","v":5104},0.1198]
[7508,{"$f":"NETWORKDAYS($B$1,$B$1+A247,Feriados!$A$2:$A$937)-1","v":5165},0.1198]
[7602,{"$f":"NETWORKDAYS($B$1,$B$1+A248,Feriados!$A$2:$A$937)-1","v":5230},0.1198]
[7693,{"$f":"NETWORKDAYS($B$1,$B$1+A249,Feriados!$A$2:$A$937)-1","v":5292},0.1198]
[7784,{"$f":"NETWORKDAYS($B$1,$B$1+A250,Feriados!$A$2:$A$937)-1","v":5355},0.1198]
[7875,{"$f":"NETWORKDAYS($B$1,$B$1+A251,Feriados!$A$2:$A$937)-1","v":5416},0.1198]
[7966,{"$f":"NETWORKDAYS($B$1,$B$1+A252,Feriados!$A$2:$A$937)-1","v":5480},0.1198]
[8059,{"$f":"NETWORKDAYS($B$1,$B$1+A253,Feriados!$A$2:$A$937)-1","v":5543},0.1198]
[8150,{"$f":"NETWORKDAYS($B$1,$B$1+A254,Feriados!$A$2:$A$937)-1","v":5608},0.1198]
[8239,{"$f":"NETWORKDAYS($B$1,$B$1+A255,Feriados!$A$2:$A$937)-1","v":5666},0.1198]
[8331,{"$f":"NETWORKDAYS($B$1,$B$1+A256,Feriados!$A$2:$A$937)-1","v":5731},0.1198]
[8515,{"$f":"NETWORKDAYS($B$1,$B$1+A257,Feriados!$A$2:$A$937)-1","v":5855},0.1198]
[8696,{"$f":"NETWORKDAYS($B$1,$B$1+A258,Feriados!$A$2:$A$937)-1","v":5981},0.1198]
[8880,{"$f":"NETWORKDAYS($B$1,$B$1+A259,Feriados!$A$2:$A$937)-1","v":6107},0.1198]
[9002,{"$f":"NETWORKDAYS($B$1,$B$1+A260,Feriados!$A$2:$A$937)-1","v":6188},0.1198]
[9061,{"$f":"NETWORKDAYS($B$1,$B$1+A261,Feriados!$A$2:$A$937)-1","v":6231},0.1198]
[9249,{"$f":"NETWORKDAYS($B$1,$B$1+A262,Feriados!$A$2:$A$937)-1","v":6360},0.1198]
[9429,{"$f":"NETWORKDAYS($B$1,$B$1+A263,Feriados!$A$2:$A$937)-1","v":6484},0.1198]
[9611,{"$f":"NETWORKDAYS($B$1,$B$1+A264,Feriados!$A$2:$A$937)-1","v":6609},0.1198]
[9793,{"$f":"NETWORKDAYS($B$1,$B$1+A265,Feriados!$A$2:$A$937)-1","v":6734},0.1198]
[9976,{"$f":"NETWORKDAYS($B$1,$B$1+A266,Feriados!$A$2:$A$937)-1","v":6861},0.1198]
[10157,{"$f":"NETWORKDAYS($B$1,$B$1+A267,Feriados!$A$2:$A$937)-1","v":6985},0.1198]
[10801,{"$f":"NETWORKDAYS($B$1,$B$1+A268,Feriados!$A$2:$A$937)-1","v":7425},0.1198]
[11893,{"$f":"NETWORKDAYS($B$1,$B$1+A269,Feriados!$A$2:$A$937)-1","v":8178},0.1198]
[13811,{"$f":"NETWORKDAYS($B$1,$B$1+A270,Feriados!$A$2:$A$937)-1","v":9499},0.1198]

{"sheet":"ETTJ x Contratos em Aberto","index":3,"n_rows":40,"n_cols":23,"rows_kept":40,"cut":false,"hidden":false,"merged":[]}
[]
[null,null,null,null,null,null,null,null,null,null,null,"Min. Liquidez Desejada",null,0,null,null,"Vencimento","Série","Taxa","Contratos","DV01",null,0]
[null,null,null,null,null,null,null,null,null,null,null,null,null,null,null,null,{"$f":"Resumo!D4","v":"2022-11-01"},{"$f":"Resumo!B4","v":"X22"},{"$f":"Resumo!G4","v":0.13649999999999918},{"$f":"IF(Resumo!H4>'ETTJ x Contratos em Aberto'!$N$2,Resumo!H4,NA())","v":721057},{"$f":"IF(Resumo!H4>'ETTJ x Contratos em Aberto'!$N$2,Resumo!J4,NA())","v":-0.20885199434997048},null,500000]
[null,null,null,null,null,null,null,null,null,null,null,null,null,null,null,null,{"$f":"Resumo!D5","v":"2022-12-01"},{"$f":"Resumo!B5","v":"Z22"},{"$f":"Resumo!G5","v":0.13669999999999982},{"$f":"IF(Resumo!H5>'ETTJ x Contratos em Aberto'!$N$2,Resumo!H5,NA())","v":447222},{"$f":"IF(Resumo!H5>'ETTJ x Contratos em Aberto'!$N$2,Resumo!J5,NA())","v":-0.89570424854173325},null,1000000]
[null,null,null,null,null,null,null,null,null,null,null,null,null,null,null,null,{"$f":"Resumo!D6","v":"2023-01-02"},{"$f":"Resumo!B6","v":"F23"},{"$f":"Resumo!G6","v":0.1368999999999998},{"$f":"IF(Resumo!H6>'ETTJ x Contratos em Aberto'!$N$2,Resumo!H6,NA())","v":5761509},{"$f":"IF(Resumo!H6>'ETTJ x Contratos em Aberto'!$N$2,Resumo!J6,NA())","v":-1.6348651188309304},null,1500000]
[null,null,null,null,null,null,null,null,null,null,null,null,null,null,null,null,{"$f":"Resumo!D7","v":"2023-02-01"},{"$f":"Resumo!B7","v":"G23"},{"$f":"Resumo!G7","v":0.1368999999999998},{"$f":"IF(Resumo!H7>'ETTJ x Contratos em Aberto'!$N$2,Resumo!H7,NA())","v":170475},{"$f":"IF(Resumo!H7>'ETTJ x Contratos em Aberto'!$N$2,Resumo!J7,NA())","v":-2.3576124749670271},null,2000000]
[null,null,null,null,null,null,null,null,null,null,null,null,null,null,null,null,{"$f":"Resumo!D8","v":"2023-03-01"},{"$f":"Resumo!B8","v":"H23"},{"$f":"Resumo!G8","v":0.13699999999999979},{"$f":"IF(Resumo!H8>'ETTJ x Contratos em Aberto'!$N$2,Resumo!H8,NA())","v":134242},{"$f":"IF(Resumo!H8>'ETTJ x Contratos em Aberto'!$N$2,Resumo!J8,NA())","v":-2.9364593411737587},null,3000000]
[null,null,null,null,null,null,null,null,null,null,null,null,null,null,null,null,{"$f":"Resumo!D9","v":"2023-04-03"},{"$f":"Resumo!B9","v":"J23"},{"$f":"Resumo!G9","v":0.13700000000000001},{"$f":"IF(Resumo!H9>'ETTJ x Contratos em Aberto'!$N$2,Resumo!H9,NA())","v":1115201},{"$f":"IF(Resumo!H9>'ETTJ x Contratos em Aberto'!$N$2,Resumo!J9,NA())","v":-3.6607772745192051},null,4000000]
[null,null,null,null,null,null,null,null,null,null,null,null,null,null,null,null,{"$f":"Resumo!D10","v":"2023-05-02"},{"$f":"Resumo!B10","v":"K23"},{"$f":"Resumo!G10","v":0.13680000000000003},{"$f":"IF(Resumo!H10>'ETTJ x Contratos em Aberto'!$N$2,Resumo!H10,NA())","v":95402},{"$f":"IF(Resumo!H10>'ETTJ x Contratos em Aberto'!$N$2,Resumo!J10,NA())","v":-4.2166862516460242},null,5000000]
[null,null,null,null,null,null,null,null,null,null,null,null,null,null,null,null,{"$f":"Resumo!D11","v":"2023-06-01"},{"$f":"Resumo!B11","v":"M23"},{"$f":"Resumo!G11","v":0.13630000000000009},{"$f":"IF(Resumo!H11>'ETTJ x Contratos em Aberto'!$N$2,Resumo!H11,NA())","v":49640},{"$f":"IF(Resumo!H11>'ETTJ x Contratos em Aberto'!$N$2,Resumo!J11,NA())","v":-4.8842859110009158}]
[null,null,null,null,null,null,null,null,null,null,null,null,null,null,null,null,{"$f":"Resumo!D12","v":"2023-07-03"},{"$f":"Resumo!B12","v":"N23"},{"$f":"Resumo!G12","v":0.13539999999999996},{"$f":"IF(Resumo!H12>'ETTJ x Contratos em Aberto'!$N$2,Resumo!H12,NA())","v":2497117},{"$f":"IF(Resumo!H12>'ETTJ x Contratos em Aberto'!$N$2,Resumo!J12,NA())","v":-5.5119533451506868}]
[null,null,null,null,null,null,null,null,null,null,null,null,null,null,null,null,{"$f":"Resumo!D13","v":"2023-08-01"},{"$f":"Resumo!B13","v":"Q23"},{"$f":"Resumo!G13","v":0.13450000000000006},{"$f":"IF(Resumo!H13>'ETTJ x Contratos em Aberto'!$N$2,Resumo!H13,NA())","v":45660},{"$f":"IF(Resumo!H13>'ETTJ x Contratos em Aberto'!$N$2,Resumo!J13,NA())","v":-6.1283728818380041}]
[null,null,null,null,null,null,null,null,null,null,null,null,null,null,null,null,{"$f":"Resumo!D14","v":"2023-09-01"},{"$f":"Resumo!B14","v":"U23"},{"$f":"Resumo!G14","v":0.13339999999999974},{"$f":"IF(Resumo!H14>'ETTJ x Contratos em Aberto'!$N$2,Resumo!H14,NA())","v":44090},{"$f":"IF(Resumo!H14>'ETTJ x Contratos em Aberto'!$N$2,Resumo!J14,NA())","v":-6.7923529373365454}]
[null,null,null,null,null,null,null,null,null,null,null,null,null,null,null,null,{"$f":"Resumo!D15","v":"2023-10-02"},{"$f":"Resumo!B15","v":"V23"},{"$f":"Resumo!G15","v":0.13240000000000007},{"$f":"IF(Resumo!H15>'ETTJ x Contratos em Aberto'!$N$2,Resumo!H15,NA())","v":395875},{"$f":"IF(Resumo!H15>'ETTJ x Contratos em Aberto'!$N$2,Resumo!J15,NA())","v":-7.3604297298152233}]
[null,null,null,null,null,null,null,null,null,null,null,null,null,null,null,null,{"$f":"Resumo!D16","v":"2024-01-02"},{"$f":"Resumo!B16","v":"F24"},{"$f":"Resumo!G16","v":0.12880000000000003},{"$f":"IF(Resumo!H16>'ETTJ x Contratos em Aberto'!$N$2,Resumo!H16,NA())","v":4766724},{"$f":"IF(Resumo!H16>'ETTJ x Contratos em Aberto'!$N$2,Resumo!J16,NA())","v":-9.0507403681112919}]
[null,null,null,null,null,null,null,null,null,null,null,null,null,null,null,null,{"$f":"Resumo!D17","v":"2024-04-01"},{"$f":"Resumo!B17","v":"J24"},{"$f":"Resumo!G17","v":0.12549999999999972},{"$f":"IF(Resumo!H17>'ETTJ x Contratos em Aberto'!$N$2,Resumo!H17,NA())","v":835139},{"$f":"IF(Resumo!H17>'ETTJ x Contratos em Aberto'!$N$2,Resumo!J17,NA())","v":-10.669573931882042}]
[null,null,null,null,null,null,null,null,null,null,null,null,null,null,null,null,{"$f":"Resumo!D18","v":"2024-07-01"},{"$f":"Resumo!B18","v":"N24"},{"$f":"Resumo!G18","v":0.12220000000000009},{"$f":"IF(Resumo!H18>'ETTJ x Contratos em Aberto'!$N$2,Resumo!H18,NA())","v":934963},{"$f":"IF(Resumo!H18>'ETTJ x Contratos em Aberto'!$N$2,Resumo!J18,NA())","v":-12.277515298395883}]
[null,null,null,null,null,null,null,null,null,null,null,null,null,null,null,null,{"$f":"Resumo!D19","v":"2024-10-01"},{"$f":"Resumo!B19","v":"V24"},{"$f":"Resumo!G19","v":0.11979999999999991},{"$f":"IF(Resumo!H19>'ETTJ x Contratos em Aberto'!$N$2,Resumo!H19,NA())","v":385270},{"$f":"IF(Resumo!H19>'ETTJ x Contratos em Aberto'!$N$2,Resumo!J19,NA())","v":-13.866447077511111}]
[null,null,null,null,null,null,null,null,null,null,null,null,null,null,null,null,{"$f":"Resumo!D20","v":"2025-01-02"},{"$f":"Resumo!B20","v":"F25"},{"$f":"Resumo!G20","v":0.11820000000000008},{"$f":"IF(Resumo!H20>'ETTJ x Contratos em Aberto'!$N$2,Resumo!H20,NA())","v":3239147},{"$f":"IF(Resumo!H20>'ETTJ x Contratos em Aberto'!$N$2,Resumo!J20,NA())","v":-15.31374630596838}]
[null,null,null,null,null,null,null,null,null,null,null,null,null,null,null,null,{"$f":"Resumo!D21","v":"2025-04-01"},{"$f":"Resumo!B21","v":"J25"},{"$f":"Resumo!G21","v":0.11729999999999996},{"$f":"IF(Resumo!H21>'ETTJ x Contratos em Aberto'!$N$2,Resumo!H21,NA())","v":90081},{"$f":"IF(Resumo!H21>'ETTJ x Contratos em Aberto'!$N$2,Resumo!J21,NA())","v":-16.600862597537343}]
[null,null,null,null,null,null,null,null,null,null,null,null,null,null,null,null,{"$f":"Resumo!D22","v":"2025-07-01"},{"$f":"Resumo!B22","v":"N25"},{"$f":"Resumo!G22","v":0.1169},{"$f":"IF(Resumo!H22>'ETTJ x Contratos em Aberto'!$N$2,Resumo!H22,NA())","v":994265},{"$f":"IF(Resumo!H22>'ETTJ x Contratos em Aberto'!$N$2,Resumo!J22,NA())","v":-17.795091694846633}]
[null,null,null,null,null,null,null,null,null,null,null,null,null,null,null,null,{"$f":"Resumo!D23","v":"2025-10-01"},{"$f":"Resumo!B23","v":"V25"},{"$f":"Resumo!G23","v":0.11719999999999997},{"$f":"IF(Resumo!H23>'ETTJ x Contratos em Aberto'!$N$2,Resumo!H23,NA())","v":61492},{"$f":"IF(Resumo!H23>'ETTJ x Contratos em Aberto'!$N$2,Resumo!J23,NA())","v":-18.962285708577838}]
[null,null,null,null,null,null,null,null,null,null,null,null,null,null,null,null,{"$f":"Resumo!D24","v":"2026-01-02"},{"$f":"Resumo!B24","v":"F26"},{"$f":"Resumo!G24","v":0.1169},{"$f":"IF(Resumo!H24>'ETTJ x Contratos em Aberto'!$N$2,Resumo!H24,NA())","v":1409237},{"$f":"IF(Resumo!H24>'ETTJ x Contratos em Aberto'!$N$2,Resumo!J24,NA())","v":-20.071105738956248}]
[null,null,null,null,null,null,null,null,null,null,null,null,null,null,null,null,{"$f":"Resumo!D25","v":"2026-04-01"},{"$f":"Resumo!B25","v":"J26"},{"$f":"Resumo!G25","v":0.11719999999999997},{"$f":"IF(Resumo!H25>'ETTJ x Contratos em Aberto'!$N$2,Resumo!H25,NA())","v":36370},{"$f":"IF(Resumo!H25>'ETTJ x Contratos em Aberto'!$N$2,Resumo!J25,NA())","v":-20.998446881014388}]
[null,null,null,null,null,null,null,null,null,null,null,null,null,null,null,null,{"$f":"Resumo!D26","v":"2026-07-01"},{"$f":"Resumo!B26","v":"N26"},{"$f":"Resumo!G26","v":0.11719999999999997},{"$f":"IF(Resumo!H26>'ETTJ x Contratos em Aberto'!$N$2,Resumo!H26,NA())","v":111945},{"$f":"IF(Resumo!H26>'ETTJ x Contratos em Aberto'!$N$2,Resumo!J26,NA())","v":-21.883995079362649}]
[null,null,null,null,null,null,null,null,null,null,null,null,null,null,null,null,{"$f":"Resumo!D27","v":"2026-10-01"},{"$f":"Resumo!B27","v":"V26"},{"$f":"Resumo!G27","v":0.11729999999999996},{"$f":"IF(Resumo!H27>'ETTJ x Contratos em Aberto'!$N$2,Resumo!H27,NA())","v":52153},{"$f":"IF(Resumo!H27>'ETTJ x Contratos em Aberto'!$N$2,Resumo!J27,NA())","v":-22.749812009991729}]
[null,null,null,null,null,null,null,null,null,null,null,null,null,null,null,null,{"$f":"Resumo!D28","v":"2027-01-04"},{"$f":"Resumo!B28","v":"F27"},{"$f":"Resumo!G28","v":0.11709999999999998},{"$f":"IF(Resumo!H28>'ETTJ x Contratos em Aberto'!$N$2,Resumo!H28,NA())","v":1043500},{"$f":"IF(Resumo!H28>'ETTJ x Contratos em Aberto'!$N$2,Resumo!J28,NA())","v":-23.555936199561984}]
[null,null,null,null,null,null,null,null,null,null,null,null,null,null,null,null,{"$f":"Resumo!D29","v":"2027-04-01"},{"$f":"Resumo!B29","v":"J27"},{"$f":"Resumo!G29","v":0.11719999999999997},{"$f":"IF(Resumo!H29>'ETTJ x Contratos em Aberto'!$N$2,Resumo!H29,NA())","v":25653},{"$f":"IF(Resumo!H29>'ETTJ x Contratos em Aberto'!$N$2,Resumo!J29,NA())","v":-24.237014026162797}]
[null,null,null,null,null,null,null,null,null,null,null,null,null,null,null,null,{"$f":"Resumo!D30","v":"2027-07-01"},{"$f":"Resumo!B30","v":"N27"},{"$f":"Resumo!G30","v":0.11729999999999996},{"$f":"IF(Resumo!H30>'ETTJ x Contratos em Aberto'!$N$2,Resumo!H30,NA())","v":23590},{"$f":"IF(Resumo!H30>'ETTJ x Contratos em Aberto'!$N$2,Resumo!J30,NA())","v":-24.895014193942188}]
[null,null,null,null,null,null,null,null,null,null,null,null,null,null,null,null,{"$f":"Resumo!D31","v":"2027-10-01"},{"$f":"Resumo!B31","v":"V27"},{"$f":"Resumo!G31","v":0.11749999999999994},{"$f":"IF(Resumo!H31>'ETTJ x Contratos em Aberto'!$N$2,Resumo!H31,NA())","v":16805},{"$f":"IF(Resumo!H31>'ETTJ x Contratos em Aberto'!$N$2,Resumo!J31,NA())","v":-25.501570314299897}]
[null,null,null,null,null,null,null,null,null,null,null,null,null,null,null,null,{"$f":"Resumo!D32","v":"2028-01-03"},{"$f":"Resumo!B32","v":"F28"},{"$f":"Resumo!G32","v":0.11769999999999992},{"$f":"IF(Resumo!H32>'ETTJ x Contratos em Aberto'!$N$2,Resumo!H32,NA())","v":94412},{"$f":"IF(Resumo!H32>'ETTJ x Contratos em Aberto'!$N$2,Resumo!J32,NA())","v":-26.032083448219055}]
[null,null,null,null,null,null,null,null,null,null,null,null,null,null,null,null,{"$f":"Resumo!D33","v":"2029-01-02"},{"$f":"Resumo!B33","v":"F29"},{"$f":"Resumo!G33","v":0.11850000000000005},{"$f":"IF(Resumo!H33>'ETTJ x Contratos em Aberto'!$N$2,Resumo!H33,NA())","v":489507},{"$f":"IF(Resumo!H33>'ETTJ x Contratos em Aberto'!$N$2,Resumo!J33,NA())","v":-27.628253580107412}]
[null,null,null,null,null,null,null,null,null,null,null,null,null,null,null,null,{"$f":"Resumo!D34","v":"2030-01-02"},{"$f":"Resumo!B34","v":"F30"},{"$f":"Resumo!G34","v":0.11890000000000001},{"$f":"IF(Resumo!H34>'ETTJ x Contratos em Aberto'!$N$2,Resumo!H34,NA())","v":51130},{"$f":"IF(Resumo!H34>'ETTJ x Contratos em Aberto'!$N$2,Resumo!J34,NA())","v":-28.615598334261449}]
[null,null,null,null,null,null,null,null,null,null,null,null,null,null,null,null,{"$f":"Resumo!D35","v":"2031-01-02"},{"$f":"Resumo!B35","v":"F31"},{"$f":"Resumo!G35","v":0.11939999999999995},{"$f":"IF(Resumo!H35>'ETTJ x Contratos em Aberto'!$N$2,Resumo!H35,NA())","v":330236},{"$f":"IF(Resumo!H35>'ETTJ x Contratos em Aberto'!$N$2,Resumo!J35,NA())","v":-29.028090691259422}]
[null,null,null,null,null,null,null,null,null,null,null,null,null,null,null,null,{"$f":"Resumo!D36","v":"2032-01-02"},{"$f":"Resumo!B36","v":"F32"},{"$f":"Resumo!G36","v":0.11949999999999994},{"$f":"IF(Resumo!H36>'ETTJ x Contratos em Aberto'!$N$2,Resumo!H36,NA())","v":20370},{"$f":"IF(Resumo!H36>'ETTJ x Contratos em Aberto'!$N$2,Resumo!J36,NA())","v":-29.080548717007332}]
[null,null,null,null,null,null,null,null,null,null,null,null,null,null,null,null,{"$f":"Resumo!D37","v":"2033-01-03"},{"$f":"Resumo!B37","v":"F33"},{"$f":"Resumo!G37","v":0.11959999999999993},{"$f":"IF(Resumo!H37>'ETTJ x Contratos em Aberto'!$N$2,Resumo!H37,NA())","v":161994},{"$f":"IF(Resumo!H37>'ETTJ x Contratos em Aberto'!$N$2,Resumo!J37,NA())","v":-28.780152757037285}]
[null,null,null,null,null,null,null,null,null,null,null,null,null,null,null,null,{"$f":"Resumo!D38","v":"2034-01-02"},{"$f":"Resumo!B38","v":"F34"},{"$f":"Resumo!G38","v":0.1198999999999999},{"$f":"IF(Resumo!H38>'ETTJ x Contratos em Aberto'!$N$2,Resumo!H38,NA())","v":1105},{"$f":"IF(Resumo!H38>'ETTJ x Contratos em Aberto'!$N$2,Resumo!J38,NA())","v":-28.143691768342251}]
[null,null,null,null,null,null,null,null,null,null,null,null,null,null,null,null,{"$f":"Resumo!D39","v":"2035-01-02"},{"$f":"Resumo!B39","v":"F35"},{"$f":"Resumo!G39","v":0.11979999999999991},{"$f":"IF(Resumo!H39>'ETTJ x Contratos em Aberto'!$N$2,Resumo!H39,NA())","v":3190},{"$f":"IF(Resumo!H39>'ETTJ x Contratos em Aberto'!$N$2,Resumo!J39,NA())","v":-27.422912135803927}]
[null,null,null,null,null,null,null,null,null,null,null,null,null,null,null,null,{"$f":"Resumo!D40","v":"2036-01-02"},{"$f":"Resumo!B40","v":"F36"},{"$f":"Resumo!G40","v":0.11979999999999991},{"$f":"IF(Resumo!H40>'ETTJ x Contratos em Aberto'!$N$2,Resumo!H40,NA())","v":19950},{"$f":"IF(Resumo!H40>'ETTJ x Contratos em Aberto'!$N$2,Resumo!J40,NA())","v":-26.511177729251358}]
[null,null,null,null,null,null,null,null,null,null,null,null,null,null,null,null,{"$f":"Resumo!D41","v":"2037-01-02"},{"$f":"Resumo!B41","v":"F37"},{"$f":"Resumo!G41","v":0.11979999999999991},{"$f":"IF(Resumo!H41>'ETTJ x Contratos em Aberto'!$N$2,Resumo!H41,NA())","v":800},{"$f":"IF(Resumo!H41>'ETTJ x Contratos em Aberto'!$N$2,Resumo!J41,NA())","v":-25.466544731065369}]

{"sheet":"Reuniões do COPOM","index":4,"n_rows":24,"n_cols":7,"rows_kept":24,"cut":false,"hidden":false,"merged":[]}
[null,"Data Atual",{"$f":"'Curva de Juros Pré'!B1","v":"2022-10-24"}]
[null,"Taxa DI",0.13650000000000001]
[]
[null,"Reuniões","Dias","ETTJ B3"]
[null,"COPOM","Úteis","Spot","Forward","D","Movimento*"]
[null,"2022-10-26",{"$f":"NETWORKDAYS($C$1,B6,Feriados!$A$2:$A$937)-1","v":2},{"$f":"InterpolaPre(C6)","v":0.13650000000001516},{"$f":"Forward($C$1,C1,B6,C2,D6,Feriados!$A$2:$A$937)","v":0.13650000000001516},{"$f":"E6-C2","v":1.5154544286133387E-14},{"$f":"IF(F6>$C$22,\"Alta\",IF(F6<-$C$22,\"Corte\",\"Manutenção\"))","v":"Manutenção"}]
[null,"2022-12-07",{"$f":"NETWORKDAYS($C$1,B7,Feriados!$A$2:$A$937)-1","v":30},{"$f":"InterpolaPre(C7)","v":0.13677111020751243},{"$f":"Forward($C$1,B6,B7,D6,D7,Feriados!$A$2:$A$937)","v":0.13680016156530006},{"$f":"E7-E6","v":3.0016156528489546E-4},{"$f":"IF(F7>$C$22,\"Alta\",IF(F7<-$C$22,\"Corte\",\"Manutenção\"))","v":"Manutenção"}]
[null,"2023-02-01",{"$f":"NETWORKDAYS($C$1,B8,Feriados!$A$2:$A$937)-1","v":70},{"$f":"InterpolaPre(C8)","v":0.1368999999999998},{"$f":"Forward($C$1,B7,B8,D7,D8,Feriados!$A$2:$A$937)","v":0.13699989964066583},{"$f":"E8-E7","v":1.9973807536577404E-4},{"$f":"IF(F8>$C$22,\"Alta\",IF(F8<-$C$22,\"Corte\",\"Manutenção\"))","v":"Manutenção"}]
[null,"2023-03-22",{"$f":"NETWORKDAYS($C$1,B9,Feriados!$A$2:$A$937)-1","v":103},{"$f":"InterpolaPre(C9)","v":0.13700000000000001},{"$f":"Forward($C$1,B8,B9,D8,D9,Feriados!$A$2:$A$937)","v":0.1372151813364284},2.1528169576257028E-4,{"$f":"IF(F9>$C$22,\"Alta\",IF(F9<-$C$22,\"Corte\",\"Manutenção\"))","v":"Manutenção"}]
[null,"2023-05-03",{"$f":"NETWORKDAYS($C$1,B10,Feriados!$A$2:$A$937)-1","v":130},{"$f":"InterpolaPre(C10)","v":0.13677640842586336},{"$f":"Forward($C$1,B9,B10,D9,D10,Feriados!$A$2:$A$937)","v":0.13591557759362005},-1.2996037428083529E-3,{"$f":"IF(F10>$C$22,\"Alta\",IF(F10<-$C$22,\"Corte\",\"Manutenção\"))","v":"Manutenção"}]
[null,"2023-06-21",{"$f":"NETWORKDAYS($C$1,B11,Feriados!$A$2:$A$937)-1","v":164},{"$f":"InterpolaPre(C11)","v":0.13569999999999993},{"$f":"Forward($C$1,B10,B11,D10,D11,Feriados!$A$2:$A$937)","v":0.1315621820590378},-4.3533955345822495E-3,{"$f":"IF(F11>$C$22,\"Alta\",IF(F11<-$C$22,\"Corte\",\"Manutenção\"))","v":"Corte"}]
[null,"2023-08-02",{"$f":"NETWORKDAYS($C$1,B12,Feriados!$A$2:$A$937)-1","v":194},{"$f":"InterpolaPre(C12)","v":0.13444767008668634},{"$f":"Forward($C$1,B11,B12,D11,D12,Feriados!$A$2:$A$937)","v":0.12758449902389346},-3.9776830351443415E-3,{"$f":"IF(F12>$C$22,\"Alta\",IF(F12<-$C$22,\"Corte\",\"Manutenção\"))","v":"Corte"}]
[null,"2023-09-20",{"$f":"NETWORKDAYS($C$1,B13,Feriados!$A$2:$A$937)-1","v":228},{"$f":"InterpolaPre(C13)","v":0.13274977959826662},{"$f":"Forward($C$1,B12,B13,D12,D13,Feriados!$A$2:$A$937)","v":0.12306084390345773},-4.5236551204357323E-3,{"$f":"IF(F13>$C$22,\"Alta\",IF(F13<-$C$22,\"Corte\",\"Manutenção\"))","v":"Corte"}]
[null,"2023-11-01",{"$f":"NETWORKDAYS($C$1,B14,Feriados!$A$2:$A$937)-1","v":257},{"$f":"InterpolaPre(C14)","v":0.13093788406020335},{"$f":"Forward($C$1,B13,B14,D13,D14,Feriados!$A$2:$A$937)","v":0.11673158698355501},-6.3292569199027149E-3,{"$f":"IF(F14>$C$22,\"Alta\",IF(F14<-$C$22,\"Corte\",\"Manutenção\"))","v":"Corte"}]
[null,"2023-12-13",{"$f":"NETWORKDAYS($C$1,B15,Feriados!$A$2:$A$937)-1","v":285},{"$f":"InterpolaPre(C15)","v":0.12929999999999997},{"$f":"Forward($C$1,B14,B15,D14,D15,Feriados!$A$2:$A$937)","v":0.1143192532897146},-2.4123336938404183E-3,{"$f":"IF(F15>$C$22,\"Alta\",IF(F15<-$C$22,\"Corte\",\"Manutenção\"))","v":"Corte"}]
[null,"2025-01-02",{"$f":"NETWORKDAYS($C$1,B16,Feriados!$A$2:$A$937)-1","v":551},{"$f":"InterpolaPre(C16)","v":0.11820000000000008},{"$f":"Forward($C$1,B15,B16,D15,D16,Feriados!$A$2:$A$937)","v":0.10638709970562266},-7.9321535840919388E-3,{"$f":"IF(F16>$C$22,\"Alta\",IF(F16<-$C$22,\"Corte\",\"Manutenção\"))","v":"Corte"}]
[null,"2026-01-02",{"$f":"NETWORKDAYS($C$1,B17,Feriados!$A$2:$A$937)-1","v":804},{"$f":"InterpolaPre(C17)","v":0.1169},{"$f":"Forward($C$1,B16,B17,D16,D17,Feriados!$A$2:$A$937)","v":0.11406887999557958},7.6817802899569188E-3,{"$f":"IF(F17>$C$22,\"Alta\",IF(F17<-$C$22,\"Corte\",\"Manutenção\"))","v":"Alta"}]
[null,"2027-01-04",{"$f":"NETWORKDAYS($C$1,B18,Feriados!$A$2:$A$937)-1","v":1054},{"$f":"InterpolaPre(C18)","v":0.11709999999999998},{"$f":"Forward($C$1,B17,B18,D17,D18,Feriados!$A$2:$A$937)","v":0.11774424335572897},3.6753633601493974E-3,{"$f":"IF(F18>$C$22,\"Alta\",IF(F18<-$C$22,\"Corte\",\"Manutenção\"))","v":"Alta"}]
[null,"2028-01-03",{"$f":"NETWORKDAYS($C$1,B19,Feriados!$A$2:$A$937)-1","v":1305},{"$f":"InterpolaPre(C19)","v":0.11769999999999992},{"$f":"Forward($C$1,B18,B19,D18,D19,Feriados!$A$2:$A$937)","v":0.12022543831326304},2.4811949575340719E-3,{"$f":"IF(F19>$C$22,\"Alta\",IF(F19<-$C$22,\"Corte\",\"Manutenção\"))","v":"Alta"}]
[]
[null,null,"As datas de COPOM de 2024 em diante ainda não estão disponíveis."]
[null,"Precisão Método",2E-3]
[null,"Separação entre erros de medida e prêmios por mal apreçamento, de liquidez e de inflação."]
[null,"*A variação reportada  como hike da política monetária pode conter prêmios de risco."]

{"sheet":"Legendas","index":5,"n_rows":19,"n_cols":4,"rows_kept":19,"cut":false,"hidden":false,"merged":[]}
[]
[]
[]
[]
[]
[]
[null,"Código","Mês","Mês Num"]
[null,"F","Janeiro","01"]
[null,"G","Fevereiro","02"]
[null,"H","Março","03"]
[null,"J","Abril","04"]
[null,"K","Maio","05"]
[null,"M","Junho","06"]
[null,"N","Julho","07"]
[null,"Q","Agosto","08"]
[null,"U","Setembro","09"]
[null,"V","Outubro","10"]
[null,"X","Novembro","11"]
[null,"Z","Dezembro","12"]

{"sheet":"Feriados","index":6,"n_rows":938,"n_cols":3,"rows_kept":938,"cut":false,"hidden":false,"merged":[]}
["Data","Dia da Semana","Feriado"]
["2001-01-01","segunda-feira","Confraternização Universal"]
["2001-02-26","segunda-feira","Carnaval"]
["2001-02-27","terça-feira","Carnaval"]
["2001-04-13","sexta-feira","Paixão de Cristo"]
["2001-04-21","sábado","Tiradentes"]
["2001-05-01","terça-feira","Dia do Trabalho"]
["2001-06-14","quinta-feira","Corpus Christi"]
["2001-09-07","sexta-feira","Independência do Brasil"]
["2001-10-12","sexta-feira","Nossa Sr.a Aparecida - Padroeira do Brasil"]
["2001-11-02","sexta-feira","Finados"]
["2001-11-15","quinta-feira","Proclamação da República"]
["2001-12-25","terça-feira","Natal"]
["2002-01-01","terça-feira","Confraternização Universal"]
["2002-02-11","segunda-feira","Carnaval"]
["2002-02-12","terça-feira","Carnaval"]
["2002-03-29","sexta-feira","Paixão de Cristo"]
["2002-04-21","domingo","Tiradentes"]
["2002-05-01","quarta-feira","Dia do Trabalho"]
["2002-05-30","quinta-feira","Corpus Christi"]
["2002-09-07","sábado","Independência do Brasil"]
["2002-10-12","sábado","Nossa Sr.a Aparecida - Padroeira do Brasil"]
["2002-11-02","sábado","Finados"]
["2002-11-15","sexta-feira","Proclamação da República"]
["2002-12-25","quarta-feira","Natal"]
["2003-01-01","quarta-feira","Confraternização Universal"]
["2003-03-03","segunda-feira","Carnaval"]
["2003-03-04","terça-feira","Carnaval"]
["2003-04-18","sexta-feira","Paixão de Cristo"]
["2003-04-21","segunda-feira","Tiradentes"]
["2003-05-01","quinta-feira","Dia do Trabalho"]
["2003-06-19","quinta-feira","Corpus Christi"]
["2003-09-07","domingo","Independência do Brasil"]
["2003-10-12","domingo","Nossa Sr.a Aparecida - Padroeira do Brasil"]
["2003-11-02","domingo","Finados"]
["2003-11-15","sábado","Proclamação da República"]
["2003-12-25","quinta-feira","Natal"]
["2004-01-01","quinta-feira","Confraternização Universal"]
["2004-02-23","segunda-feira","Carnaval"]
["2004-02-24","terça-feira","Carnaval"]
["2004-04-09","sexta-feira","Paixão de Cristo"]
["2004-04-21","quarta-feira","Tiradentes"]
["2004-05-01","sábado","Dia do Trabalho"]
["2004-06-10","quinta-feira","Corpus Christi"]
["2004-09-07","terça-feira","Independência do Brasil"]
["2004-10-12","terça-feira","Nossa Sr.a Aparecida - Padroeira do Brasil"]
["2004-11-02","terça-feira","Finados"]
["2004-11-15","segunda-feira","Proclamação da República"]
["2004-12-25","sábado","Natal"]
["2005-01-01","sábado","Confraternização Universal"]
["2005-02-07","segunda-feira","Carnaval"]
["2005-02-08","terça-feira","Carnaval"]
["2005-03-25","sexta-feira","Paixão de Cristo"]
["2005-04-21","quinta-feira","Tiradentes"]
["2005-05-01","domingo","Dia do Trabalho"]
["2005-05-26","quinta-feira","Corpus Christi"]
["2005-09-07","quarta-feira","Independência do Brasil"]
["2005-10-12","quarta-feira","Nossa Sr.a Aparecida - Padroeira do Brasil"]
["2005-11-02","quarta-feira","Finados"]
["2005-11-15","terça-feira","Proclamação da República"]
["2005-12-25","domingo","Natal"]
["2006-01-01","domingo","Confraternização Universal"]
["2006-02-27","segunda-feira","Carnaval"]
["2006-02-28","terça-feira","Carnaval"]
["2006-04-14","sexta-feira","Paixão de Cristo"]
["2006-04-21","sexta-feira","Tiradentes"]
["2006-05-01","segunda-feira","Dia do Trabalho"]
["2006-06-15","quinta-feira","Corpus Christi"]
["2006-09-07","quinta-feira","Independência do Brasil"]
["2006-10-12","quinta-feira","Nossa Sr.a Aparecida - Padroeira do Brasil"]
["2006-11-02","quinta-feira","Finados"]
["2006-11-15","quarta-feira","Proclamação da República"]
["2006-12-25","segunda-feira","Natal"]
["2007-01-01","segunda-feira","Confraternização Universal"]
["2007-02-19","segunda-feira","Carnaval"]
["2007-02-20","terça-feira","Carnaval"]
["2007-04-06","sexta-feira","Paixão de Cristo"]
["2007-04-21","sábado","Tiradentes"]
["2007-05-01","terça-feira","Dia do Trabalho"]
["2007-06-07","quinta-feira","Corpus Christi"]
["2007-09-07","sexta-feira","Independência do Brasil"]
["2007-10-12","sexta-feira","Nossa Sr.a Aparecida - Padroeira do Brasil"]
["2007-11-02","sexta-feira","Finados"]
["2007-11-15","quinta-feira","Proclamação da República"]
["2007-12-25","terça-feira","Natal"]
["2008-01-01","terça-feira","Confraternização Universal"]
["2008-02-04","segunda-feira","Carnaval"]
["2008-02-05","terça-feira","Carnaval"]
["2008-03-21","sexta-feira","Paixão de Cristo"]
["2008-04-21","segunda-feira","Tiradentes"]
["2008-05-01","quinta-feira","Dia do Trabalho"]
["2008-05-22","quinta-feira","Corpus Christi"]
["2008-09-07","domingo","Independência do Brasil"]
["2008-10-12","domingo","Nossa Sr.a Aparecida - Padroeira do Brasil"]
["2008-11-02","domingo","Finados"]
["2008-11-15","sábado","Proclamação da República"]
["2008-12-25","quinta-feira","Natal"]
["2009-01-01","quinta-feira","Confraternização Universal"]
["2009-02-23","segunda-feira","Carnaval"]
["2009-02-24","terça-feira","Carnaval"]
["2009-04-10","sexta-feira","Paixão de Cristo"]
["2009-04-21","terça-feira","Tiradentes"]
["2009-05-01","sexta-feira","Dia do Trabalho"]
["2009-06-11","quinta-feira","Corpus Christi"]
["2009-09-07","segunda-feira","Independência do Brasil"]
["2009-10-12","segunda-feira","Nossa Sr.a Aparecida - Padroeira do Brasil"]
["2009-11-02","segunda-feira","Finados"]
["2009-11-15","domingo","Proclamação da República"]
["2009-12-25","sexta-feira","Natal"]
["2010-01-01","sexta-feira","Confraternização Universal"]
["2010-02-15","segunda-feira","Carnaval"]
["2010-02-16","terça-feira","Carnaval"]
["2010-04-02","sexta-feira","Paixão de Cristo"]
["2010-04-21","quarta-feira","Tiradentes"]
["2010-05-01","sábado","Dia do Trabalho"]
["2010-06-03","quinta-feira","Corpus Christi"]
["2010-09-07","terça-feira","Independência do Brasil"]
["2010-10-12","terça-feira","Nossa Sr.a Aparecida - Padroeira do Brasil"]
["2010-11-02","terça-feira","Finados"]
["2010-11-15","segunda-feira","Proclamação da República"]
["2010-12-25","sábado","Natal"]
["2011-01-01","sábado","Confraternização Universal"]
["2011-03-07","segunda-feira","Carnaval"]
["2011-03-08","terça-feira","Carnaval"]
["2011-04-21","quinta-feira","Paixão de Cristo"]
["2011-04-22","sexta-feira","Tiradentes"]
["2011-05-01","domingo","Dia do Trabalho"]
["2011-06-23","quinta-feira","Corpus Christi"]
["2011-09-07","quarta-feira","Independência do Brasil"]
["2011-10-12","quarta-feira","Nossa Sr.a Aparecida - Padroeira do Brasil"]
["2011-11-02","quarta-feira","Finados"]
["2011-11-15","terça-feira","Proclamação da República"]
["2011-12-25","domingo","Natal"]
["2012-01-01","domingo","Confraternização Universal"]
["2012-02-20","segunda-feira","Carnaval"]
["2012-02-21","terça-feira","Carnaval"]
["2012-04-06","sexta-feira","Paixão de Cristo"]
["2012-04-21","sábado","Tiradentes"]
["2012-05-01","terça-feira","Dia do Trabalho"]
["2012-06-07","quinta-feira","Corpus Christi"]
["2012-09-07","sexta-feira","Independência do Brasil"]
["2012-10-12","sexta-feira","Nossa Sr.a Aparecida - Padroeira do Brasil"]
["2012-11-02","sexta-feira","Finados"]
["2012-11-15","quinta-feira","Proclamação da República"]
["2012-12-25","terça-feira","Natal"]
["2013-01-01","terça-feira","Confraternização Universal"]
["2013-02-11","segunda-feira","Carnaval"]
["2013-02-12","terça-feira","Carnaval"]
["2013-03-29","sexta-feira","Paixão de Cristo"]
["2013-04-21","domingo","Tiradentes"]
["2013-05-01","quarta-feira","Dia do Trabalho"]
["2013-05-30","quinta-feira","Corpus Christi"]
["2013-09-07","sábado","Independência do Brasil"]
["2013-10-12","sábado","Nossa Sr.a Aparecida - Padroeira do Brasil"]
["2013-11-02","sábado","Finados"]
["2013-11-15","sexta-feira","Proclamação da República"]
["2013-12-25","quarta-feira","Natal"]
["2014-01-01","quarta-feira","Confraternização Universal"]
["2014-03-03","segunda-feira","Carnaval"]
["2014-03-04","terça-feira","Carnaval"]
["2014-04-18","sexta-feira","Paixão de Cristo"]
["2014-04-21","segunda-feira","Tiradentes"]
["2014-05-01","quinta-feira","Dia do Trabalho"]
["2014-06-19","quinta-feira","Corpus Christi"]
["2014-09-07","domingo","Independência do Brasil"]
["2014-10-12","domingo","Nossa Sr.a Aparecida - Padroeira do Brasil"]
["2014-11-02","domingo","Finados"]
["2014-11-15","sábado","Proclamação da República"]
["2014-12-25","quinta-feira","Natal"]
["2015-01-01","quinta-feira","Confraternização Universal"]
["2015-02-16","segunda-feira","Carnaval"]
["2015-02-17","terça-feira","Carnaval"]
["2015-04-03","sexta-feira","Paixão de Cristo"]
["2015-04-21","terça-feira","Tiradentes"]
["2015-05-01","sexta-feira","Dia do Trabalho"]
["2015-06-04","quinta-feira","Corpus Christi"]
["2015-09-07","segunda-feira","Independência do Brasil"]
["2015-10-12","segunda-feira","Nossa Sr.a Aparecida - Padroeira do Brasil"]
["2015-11-02","segunda-feira","Finados"]
["2015-11-15","domingo","Proclamação da República"]
["2015-12-25","sexta-feira","Natal"]
["2016-01-01","sexta-feira","Confraternização Universal"]
["2016-02-08","segunda-feira","Carnaval"]
["2016-02-09","terça-feira","Carnaval"]
["2016-03-25","sexta-feira","Paixão de Cristo"]
["2016-04-21","quinta-feira","Tiradentes"]
["2016-05-01","domingo","Dia do Trabalho"]
["2016-05-26","quinta-feira","Corpus Christi"]
["2016-09-07","quarta-feira","Independência do Brasil"]
["2016-10-12","quarta-feira","Nossa Sr.a Aparecida - Padroeira do Brasil"]
["2016-11-02","quarta-feira","Finados"]
["2016-11-15","terça-feira","Proclamação da República"]
["2016-12-25","domingo","Natal"]
["2017-01-01","domingo","Confraternização Universal"]
["2017-02-27","segunda-feira","Carnaval"]
["2017-02-28","terça-feira","Carnaval"]
["2017-04-14","sexta-feira","Paixão de Cristo"]
["2017-04-21","sexta-feira","Tiradentes"]
["2017-05-01","segunda-feira","Dia do Trabalho"]
["2017-06-15","quinta-feira","Corpus Christi"]
["2017-09-07","quinta-feira","Independência do Brasil"]
["2017-10-12","quinta-feira","Nossa Sr.a Aparecida - Padroeira do Brasil"]
["2017-11-02","quinta-feira","Finados"]
["2017-11-15","quarta-feira","Proclamação da República"]
["2017-12-25","segunda-feira","Natal"]
["2018-01-01","segunda-feira","Confraternização Universal"]
["2018-02-12","segunda-feira","Carnaval"]
["2018-02-13","terça-feira","Carnaval"]
["2018-03-30","sexta-feira","Paixão de Cristo"]
["2018-04-21","sábado","Tiradentes"]
["2018-05-01","terça-feira","Dia do Trabalho"]
["2018-05-31","quinta-feira","Corpus Christi"]
["2018-09-07","sexta-feira","Independência do Brasil"]
["2018-10-12","sexta-feira","Nossa Sr.a Aparecida - Padroeira do Brasil"]
["2018-11-02","sexta-feira","Finados"]
["2018-11-15","quinta-feira","Proclamação da República"]
["2018-12-25","terça-feira","Natal"]
["2019-01-01","terça-feira","Confraternização Universal"]
["2019-03-04","segunda-feira","Carnaval"]
["2019-03-05","terça-feira","Carnaval"]
["2019-04-19","sexta-feira","Paixão de Cristo"]
["2019-04-21","domingo","Tiradentes"]
["2019-05-01","quarta-feira","Dia do Trabalho"]
["2019-06-20","quinta-feira","Corpus Christi"]
["2019-09-07","sábado","Independência do Brasil"]
["2019-10-12","sábado","Nossa Sr.a Aparecida - Padroeira do Brasil"]
["2019-11-02","sábado","Finados"]
["2019-11-15","sexta-feira","Proclamação da República"]
["2019-12-25","quarta-feira","Natal"]
["2020-01-01","quarta-feira","Confraternização Universal"]
["2020-02-24","segunda-feira","Carnaval"]
["2020-02-25","terça-feira","Carnaval"]
["2020-04-10","sexta-feira","Paixão de Cristo"]
["2020-04-21","terça-feira","Tiradentes"]
["2020-05-01","sexta-feira","Dia do Trabalho"]
["2020-06-11","quinta-feira","Corpus Christi"]
["2020-09-07","segunda-feira","Independência do Brasil"]
["2020-10-12","segunda-feira","Nossa Sr.a Aparecida - Padroeira do Brasil"]
["2020-11-02","segunda-feira","Finados"]
["2020-11-15","domingo","Proclamação da República"]
["2020-12-25","sexta-feira","Natal"]
["2021-01-01","sexta-feira","Confraternização Universal"]
["2021-02-15","segunda-feira","Carnaval"]
["2021-02-16","terça-feira","Carnaval"]
["2021-04-02","sexta-feira","Paixão de Cristo"]
["2021-04-21","quarta-feira","Tiradentes"]
["2021-05-01","sábado","Dia do Trabalho"]
["2021-06-03","quinta-feira","Corpus Christi"]
["2021-09-07","terça-feira","Independência do Brasil"]
["2021-10-12","terça-feira","Nossa Sr.a Aparecida - Padroeira do Brasil"]
["2021-11-02","terça-feira","Finados"]
["2021-11-15","segunda-feira","Proclamação da República"]
["2021-12-25","sábado","Natal"]
["2022-01-01","sábado","Confraternização Universal"]
["2022-02-28","segunda-feira","Carnaval"]
["2022-03-01","terça-feira","Carnaval"]
["2022-04-15","sexta-feira","Paixão de Cristo"]
["2022-04-21","quinta-feira","Tiradentes"]
["2022-05-01","domingo","Dia do Trabalho"]
["2022-06-16","quinta-feira","Corpus Christi"]
["2022-09-07","quarta-feira","Independência do Brasil"]
["2022-10-12","quarta-feira","Nossa Sr.a Aparecida - Padroeira do Brasil"]
["2022-11-02","quarta-feira","Finados"]
["2022-11-15","terça-feira","Proclamação da República"]
["2022-12-25","domingo","Natal"]
["2023-01-01","domingo","Confraternização Universal"]
["2023-02-20","segunda-feira","Carnaval"]
["2023-02-21","terça-feira","Carnaval"]
["2023-04-07","sexta-feira","Paixão de Cristo"]
["2023-04-21","sexta-feira","Tiradentes"]
["2023-05-01","segunda-feira","Dia do Trabalho"]
["2023-06-08","quinta-feira","Corpus Christi"]
["2023-09-07","quinta-feira","Independência do Brasil"]
["2023-10-12","quinta-feira","Nossa Sr.a Aparecida - Padroeira do Brasil"]
["2023-11-02","quinta-feira","Finados"]
["2023-11-15","quarta-feira","Proclamação da República"]
["2023-12-25","segunda-feira","Natal"]
["2024-01-01","segunda-feira","Confraternização Universal"]
["2024-02-12","segunda-feira","Carnaval"]
["2024-02-13","terça-feira","Carnaval"]
["2024-03-29","sexta-feira","Paixão de Cristo"]
["2024-04-21","domingo","Tiradentes"]
["2024-05-01","quarta-feira","Dia do Trabalho"]
["2024-05-30","quinta-feira","Corpus Christi"]
["2024-09-07","sábado","Independência do Brasil"]
["2024-10-12","sábado","Nossa Sr.a Aparecida - Padroeira do Brasil"]
["2024-11-02","sábado","Finados"]
["2024-11-15","sexta-feira","Proclamação da República"]
["2024-12-25","quarta-feira","Natal"]
["2025-01-01","quarta-feira","Confraternização Universal"]
["2025-03-03","segunda-feira","Carnaval"]
["2025-03-04","terça-feira","Carnaval"]
["2025-04-18","sexta-feira","Paixão de Cristo"]
["2025-04-21","segunda-feira","Tiradentes"]
["2025-05-01","quinta-feira","Dia do Trabalho"]
["2025-06-19","quinta-feira","Corpus Christi"]
["2025-09-07","domingo","Independência do Brasil"]
["2025-10-12","domingo","Nossa Sr.a Aparecida - Padroeira do Brasil"]
["2025-11-02","domingo","Finados"]
["2025-11-15","sábado","Proclamação da República"]
["2025-12-25","quinta-feira","Natal"]
["2026-01-01","quinta-feira","Confraternização Universal"]
["2026-02-16","segunda-feira","Carnaval"]
["2026-02-17","terça-feira","Carnaval"]
["2026-04-03","sexta-feira","Paixão de Cristo"]
["2026-04-21","terça-feira","Tiradentes"]
["2026-05-01","sexta-feira","Dia do Trabalho"]
["2026-06-04","quinta-feira","Corpus Christi"]
["2026-09-07","segunda-feira","Independência do Brasil"]
["2026-10-12","segunda-feira","Nossa Sr.a Aparecida - Padroeira do Brasil"]
["2026-11-02","segunda-feira","Finados"]
["2026-11-15","domingo","Proclamação da República"]
["2026-12-25","sexta-feira","Natal"]
["2027-01-01","sexta-feira","Confraternização Universal"]
["2027-02-08","segunda-feira","Carnaval"]
["2027-02-09","terça-feira","Carnaval"]
["2027-03-26","sexta-feira","Paixão de Cristo"]
["2027-04-21","quarta-feira","Tiradentes"]
["2027-05-01","sábado","Dia do Trabalho"]
["2027-05-27","quinta-feira","Corpus Christi"]
["2027-09-07","terça-feira","Independência do Brasil"]
["2027-10-12","terça-feira","Nossa Sr.a Aparecida - Padroeira do Brasil"]
["2027-11-02","terça-feira","Finados"]
["2027-11-15","segunda-feira","Proclamação da República"]
["2027-12-25","sábado","Natal"]
["2028-01-01","sábado","Confraternização Universal"]
["2028-02-28","segunda-feira","Carnaval"]
["2028-02-29","terça-feira","Carnaval"]
["2028-04-14","sexta-feira","Paixão de Cristo"]
["2028-04-21","sexta-feira","Tiradentes"]
["2028-05-01","segunda-feira","Dia do Trabalho"]
["2028-06-15","quinta-feira","Corpus Christi"]
["2028-09-07","quinta-feira","Independência do Brasil"]
["2028-10-12","quinta-feira","Nossa Sr.a Aparecida - Padroeira do Brasil"]
["2028-11-02","quinta-feira","Finados"]
["2028-11-15","quarta-feira","Proclamação da República"]
["2028-12-25","segunda-feira","Natal"]
["2029-01-01","segunda-feira","Confraternização Universal"]
["2029-02-12","segunda-feira","Carnaval"]
["2029-02-13","terça-feira","Carnaval"]
["2029-03-30","sexta-feira","Paixão de Cristo"]
["2029-04-21","sábado","Tiradentes"]
["2029-05-01","terça-feira","Dia do Trabalho"]
["2029-05-31","quinta-feira","Corpus Christi"]
["2029-09-07","sexta-feira","Independência do Brasil"]
["2029-10-12","sexta-feira","Nossa Sr.a Aparecida - Padroeira do Brasil"]
["2029-11-02","sexta-feira","Finados"]
["2029-11-15","quinta-feira","Proclamação da República"]
["2029-12-25","terça-feira","Natal"]
["2030-01-01","terça-feira","Confraternização Universal"]
["2030-03-04","segunda-feira","Carnaval"]
["2030-03-05","terça-feira","Carnaval"]
["2030-04-19","sexta-feira","Paixão de Cristo"]
["2030-04-21","domingo","Tiradentes"]
["2030-05-01","quarta-feira","Dia do Trabalho"]
["2030-06-20","quinta-feira","Corpus Christi"]
["2030-09-07","sábado","Independência do Brasil"]
["2030-10-12","sábado","Nossa Sr.a Aparecida - Padroeira do Brasil"]
["2030-11-02","sábado","Finados"]
["2030-11-15","sexta-feira","Proclamação da República"]
["2030-12-25","quarta-feira","Natal"]
["2031-01-01","quarta-feira","Confraternização Universal"]
["2031-02-24","segunda-feira","Carnaval"]
["2031-02-25","terça-feira","Carnaval"]
["2031-04-11","sexta-feira","Paixão de Cristo"]
["2031-04-21","segunda-feira","Tiradentes"]
["2031-05-01","quinta-feira","Dia do Trabalho"]
["2031-06-12","quinta-feira","Corpus Christi"]
["2031-09-07","domingo","Independência do Brasil"]
["2031-10-12","domingo","Nossa Sr.a Aparecida - Padroeira do Brasil"]
["2031-11-02","domingo","Finados"]
["2031-11-15","sábado","Proclamação da República"]
["2031-12-25","quinta-feira","Natal"]
["2032-01-01","quinta-feira","Confraternização Universal"]
["2032-02-09","segunda-feira","Carnaval"]
["2032-02-10","terça-feira","Carnaval"]
["2032-03-26","sexta-feira","Paixão de Cristo"]
["2032-04-21","quarta-feira","Tiradentes"]
["2032-05-01","sábado","Dia do Trabalho"]
["2032-05-27","quinta-feira","Corpus Christi"]
["2032-09-07","terça-feira","Independência do Brasil"]
["2032-10-12","terça-feira","Nossa Sr.a Aparecida - Padroeira do Brasil"]
["2032-11-02","terça-feira","Finados"]
["2032-11-15","segunda-feira","Proclamação da República"]
["2032-12-25","sábado","Natal"]
["2033-01-01","sábado","Confraternização Universal"]
["2033-02-28","segunda-feira","Carnaval"]
["2033-03-01","terça-feira","Carnaval"]
["2033-04-15","sexta-feira","Paixão de Cristo"]
["2033-04-21","quinta-feira","Tiradentes"]
["2033-05-01","domingo","Dia do Trabalho"]
["2033-06-16","quinta-feira","Corpus Christi"]
["2033-09-07","quarta-feira","Independência do Brasil"]
["2033-10-12","quarta-feira","Nossa Sr.a Aparecida - Padroeira do Brasil"]
["2033-11-02","quarta-feira","Finados"]
["2033-11-15","terça-feira","Proclamação da República"]
["2033-12-25","domingo","Natal"]
["2034-01-01","domingo","Confraternização Universal"]
["2034-02-20","segunda-feira","Carnaval"]
["2034-02-21","terça-feira","Carnaval"]
["2034-04-07","sexta-feira","Paixão de Cristo"]
["2034-04-21","sexta-feira","Tiradentes"]
["2034-05-01","segunda-feira","Dia do Trabalho"]
["2034-06-08","quinta-feira","Corpus Christi"]
["2034-09-07","quinta-feira","Independência do Brasil"]
["2034-10-12","quinta-feira","Nossa Sr.a Aparecida - Padroeira do Brasil"]
["2034-11-02","quinta-feira","Finados"]
["2034-11-15","quarta-feira","Proclamação da República"]
["2034-12-25","segunda-feira","Natal"]
["2035-01-01","segunda-feira","Confraternização Universal"]
["2035-02-05","segunda-feira","Carnaval"]
["2035-02-06","terça-feira","Carnaval"]
["2035-03-23","sexta-feira","Paixão de Cristo"]
["2035-04-21","sábado","Tiradentes"]
["2035-05-01","terça-feira","Dia do Trabalho"]
["2035-05-24","quinta-feira","Corpus Christi"]
["2035-09-07","sexta-feira","Independência do Brasil"]
["2035-10-12","sexta-feira","Nossa Sr.a Aparecida - Padroeira do Brasil"]
["2035-11-02","sexta-feira","Finados"]
["2035-11-15","quinta-feira","Proclamação da República"]
["2035-12-25","terça-feira","Natal"]
["2036-01-01","terça-feira","Confraternização Universal"]
["2036-02-25","segunda-feira","Carnaval"]
["2036-02-26","terça-feira","Carnaval"]
["2036-04-11","sexta-feira","Paixão de Cristo"]
["2036-04-21","segunda-feira","Tiradentes"]
["2036-05-01","quinta-feira","Dia do Trabalho"]
["2036-06-12","quinta-feira","Corpus Christi"]
["2036-09-07","domingo","Independência do Brasil"]
["2036-10-12","domingo","Nossa Sr.a Aparecida - Padroeira do Brasil"]
["2036-11-02","domingo","Finados"]
["2036-11-15","sábado","Proclamação da República"]
["2036-12-25","quinta-feira","Natal"]
["2037-01-01","quinta-feira","Confraternização Universal"]
["2037-02-16","segunda-feira","Carnaval"]
["2037-02-17","terça-feira","Carnaval"]
["2037-04-03","sexta-feira","Paixão de Cristo"]
["2037-04-21","terça-feira","Tiradentes"]
["2037-05-01","sexta-feira","Dia do Trabalho"]
["2037-06-04","quinta-feira","Corpus Christi"]
["2037-09-07","segunda-feira","Independência do Brasil"]
["2037-10-12","segunda-feira","Nossa Sr.a Aparecida - Padroeira do Brasil"]
["2037-11-02","segunda-feira","Finados"]
["2037-11-15","domingo","Proclamação da República"]
["2037-12-25","sexta-feira","Natal"]
["2038-01-01","sexta-feira","Confraternização Universal"]
["2038-03-08","segunda-feira","Carnaval"]
["2038-03-09","terça-feira","Carnaval"]
["2038-04-21","quarta-feira","Tiradentes"]
["2038-04-23","sexta-feira","Paixão de Cristo"]
["2038-05-01","sábado","Dia do Trabalho"]
["2038-06-24","quinta-feira","Corpus Christi"]
["2038-09-07","terça-feira","Independência do Brasil"]
["2038-10-12","terça-feira","Nossa Sr.a Aparecida - Padroeira do Brasil"]
["2038-11-02","terça-feira","Finados"]
["2038-11-15","segunda-feira","Proclamação da República"]
["2038-12-25","sábado","Natal"]
["2039-01-01","sábado","Confraternização Universal"]
["2039-02-21","segunda-feira","Carnaval"]
["2039-02-22","terça-feira","Carnaval"]
["2039-04-08","sexta-feira","Paixão de Cristo"]
["2039-04-21","quinta-feira","Tiradentes"]
["2039-05-01","domingo","Dia do Trabalho"]
["2039-06-09","quinta-feira","Corpus Christi"]
["2039-09-07","quarta-feira","Independência do Brasil"]
["2039-10-12","quarta-feira","Nossa Sr.a Aparecida - Padroeira do Brasil"]
["2039-11-02","quarta-feira","Finados"]
["2039-11-15","terça-feira","Proclamação da República"]
["2039-12-25","domingo","Natal"]
["2040-01-01","domingo","Confraternização Universal"]
["2040-02-13","segunda-feira","Carnaval"]
["2040-02-14","terça-feira","Carnaval"]
["2040-03-30","sexta-feira","Paixão de Cristo"]
["2040-04-21","sábado","Tiradentes"]
["2040-05-01","terça-feira","Dia do Trabalho"]
["2040-05-31","quinta-feira","Corpus Christi"]
["2040-09-07","sexta-feira","Independência do Brasil"]
["2040-10-12","sexta-feira","Nossa Sr.a Aparecida - Padroeira do Brasil"]
["2040-11-02","sexta-feira","Finados"]
["2040-11-15","quinta-feira","Proclamação da República"]
["2040-12-25","terça-feira","Natal"]
["2041-01-01","terça-feira","Confraternização Universal"]
["2041-03-04","segunda-feira","Carnaval"]
["2041-03-05","terça-feira","Carnaval"]
["2041-04-19","sexta-feira","Paixão de Cristo"]
["2041-04-21","domingo","Tiradentes"]
["2041-05-01","quarta-feira","Dia do Trabalho"]
["2041-06-20","quinta-feira","Corpus Christi"]
["2041-09-07","sábado","Independência do Brasil"]
["2041-10-12","sábado","Nossa Sr.a Aparecida - Padroeira do Brasil"]
["2041-11-02","sábado","Finados"]
["2041-11-15","sexta-feira","Proclamação da República"]
["2041-12-25","quarta-feira","Natal"]
["2042-01-01","quarta-feira","Confraternização Universal"]
["2042-02-17","segunda-feira","Carnaval"]
["2042-02-18","terça-feira","Carnaval"]
["2042-04-04","sexta-feira","Paixão de Cristo"]
["2042-04-21","segunda-feira","Tiradentes"]
["2042-05-01","quinta-feira","Dia do Trabalho"]
["2042-06-05","quinta-feira","Corpus Christi"]
["2042-09-07","domingo","Independência do Brasil"]
["2042-10-12","domingo","Nossa Sr.a Aparecida - Padroeira do Brasil"]
["2042-11-02","domingo","Finados"]
["2042-11-15","sábado","Proclamação da República"]
["2042-12-25","quinta-feira","Natal"]
["2043-01-01","quinta-feira","Confraternização Universal"]
["2043-02-09","segunda-feira","Carnaval"]
["2043-02-10","terça-feira","Carnaval"]
["2043-03-27","sexta-feira","Paixão de Cristo"]
["2043-04-21","terça-feira","Tiradentes"]
["2043-05-01","sexta-feira","Dia do Trabalho"]
["2043-05-28","quinta-feira","Corpus Christi"]
["2043-09-07","segunda-feira","Independência do Brasil"]
["2043-10-12","segunda-feira","Nossa Sr.a Aparecida - Padroeira do Brasil"]
["2043-11-02","segunda-feira","Finados"]
["2043-11-15","domingo","Proclamação da República"]
["2043-12-25","sexta-feira","Natal"]
["2044-01-01","sexta-feira","Confraternização Universal"]
["2044-02-29","segunda-feira","Carnaval"]
["2044-03-01","terça-feira","Carnaval"]
["2044-04-15","sexta-feira","Paixão de Cristo"]
["2044-04-21","quinta-feira","Tiradentes"]
["2044-05-01","domingo","Dia do Trabalho"]
["2044-06-16","quinta-feira","Corpus Christi"]
["2044-09-07","quarta-feira","Independência do Brasil"]
["2044-10-12","quarta-feira","Nossa Sr.a Aparecida - Padroeira do Brasil"]
["2044-11-02","quarta-feira","Finados"]
["2044-11-15","terça-feira","Proclamação da República"]
["2044-12-25","domingo","Natal"]
["2045-01-01","domingo","Confraternização Universal"]
["2045-02-20","segunda-feira","Carnaval"]
["2045-02-21","terça-feira","Carnaval"]
["2045-04-07","sexta-feira","Paixão de Cristo"]
["2045-04-21","sexta-feira","Tiradentes"]
["2045-05-01","segunda-feira","Dia do Trabalho"]
["2045-06-08","quinta-feira","Corpus Christi"]
["2045-09-07","quinta-feira","Independência do Brasil"]
["2045-10-12","quinta-feira","Nossa Sr.a Aparecida - Padroeira do Brasil"]
["2045-11-02","quinta-feira","Finados"]
["2045-11-15","quarta-feira","Proclamação da República"]
["2045-12-25","segunda-feira","Natal"]
["2046-01-01","segunda-feira","Confraternização Universal"]
["2046-02-05","segunda-feira","Carnaval"]
["2046-02-06","terça-feira","Carnaval"]
["2046-03-23","sexta-feira","Paixão de Cristo"]
["2046-04-21","sábado","Tiradentes"]
["2046-05-01","terça-feira","Dia do Trabalho"]
["2046-05-24","quinta-feira","Corpus Christi"]
["2046-09-07","sexta-feira","Independência do Brasil"]
["2046-10-12","sexta-feira","Nossa Sr.a Aparecida - Padroeira do Brasil"]
["2046-11-02","sexta-feira","Finados"]
["2046-11-15","quinta-feira","Proclamação da República"]
["2046-12-25","terça-feira","Natal"]
["2047-01-01","terça-feira","Confraternização Universal"]
["2047-02-25","segunda-feira","Carnaval"]
["2047-02-26","terça-feira","Carnaval"]
["2047-04-12","sexta-feira","Paixão de Cristo"]
["2047-04-21","terça-feira","Tiradentes"]
["2047-05-01","quarta-feira","Dia do Trabalho"]
["2047-06-13","quinta-feira","Corpus Christi"]
["2047-09-07","sábado","Independência do Brasil"]
["2047-10-12","sábado","Nossa Sr.a Aparecida - Padroeira do Brasil"]
["2047-11-02","sábado","Finados"]
["2047-11-15","sexta-feira","Proclamação da República"]
["2047-12-25","quarta-feira","Natal"]
["2048-01-01","quarta-feira","Confraternização Universal"]
["2048-02-17","segunda-feira","Carnaval"]
["2048-02-18","terça-feira","Carnaval"]
["2048-04-03","sexta-feira","Paixão de Cristo"]
["2048-04-21","terça-feira","Tiradentes"]
["2048-05-01","sexta-feira","Dia do Trabalho"]
["2048-06-04","quinta-feira","Corpus Christi"]
["2048-09-07","segunda-feira","Independência do Brasil"]
["2048-10-12","segunda-feira","Nossa Sr.a Aparecida - Padroeira do Brasil"]
["2048-11-02","segunda-feira","Finados"]
["2048-11-15","domingo","Proclamação da República"]
["2048-12-25","sexta-feira","Natal"]
["2049-01-01","sexta-feira","Confraternização Universal"]
["2049-03-01","segunda-feira","Carnaval"]
["2049-03-02","terça-feira","Carnaval"]
["2049-04-16","sexta-feira","Paixão de Cristo"]
["2049-04-21","quarta-feira","Tiradentes"]
["2049-05-01","sábado","Dia do Trabalho"]
["2049-06-17","quinta-feira","Corpus Christi"]
["2049-09-07","terça-feira","Independência do Brasil"]
["2049-10-12","terça-feira","Nossa Sr.a Aparecida - Padroeira do Brasil"]
["2049-11-02","terça-feira","Finados"]
["2049-11-15","segunda-feira","Proclamação da República"]
["2049-12-25","sábado","Natal"]
["2050-01-01","sábado","Confraternização Universal"]
["2050-02-21","segunda-feira","Carnaval"]
["2050-02-22","terça-feira","Carnaval"]
["2050-04-08","sexta-feira","Paixão de Cristo"]
["2050-04-21","quinta-feira","Tiradentes"]
["2050-05-01","domingo","Dia do Trabalho"]
["2050-06-09","quinta-feira","Corpus Christi"]
["2050-09-07","quarta-feira","Independência do Brasil"]
["2050-10-12","quarta-feira","Nossa Sr.a Aparecida - Padroeira do Brasil"]
["2050-11-02","quarta-feira","Finados"]
["2050-11-15","terça-feira","Proclamação da República"]
["2050-12-25","domingo","Natal"]
["2051-01-01","domingo","Confraternização Universal"]
["2051-02-13","segunda-feira","Carnaval"]
["2051-02-14","terça-feira","Carnaval"]
["2051-03-31","sexta-feira","Paixão de Cristo"]
["2051-04-21","sexta-feira","Tiradentes"]
["2051-05-01","segunda-feira","Dia do Trabalho"]
["2051-06-01","quinta-feira","Corpus Christi"]
["2051-09-07","quinta-feira","Independência do Brasil"]
["2051-10-12","quinta-feira","Nossa Sr.a Aparecida - Padroeira do Brasil"]
["2051-11-02","quinta-feira","Finados"]
["2051-11-15","quarta-feira","Proclamação da República"]
["2051-12-25","segunda-feira","Natal"]
["2052-01-01","segunda-feira","Confraternização Universal"]
["2052-03-04","segunda-feira","Carnaval"]
["2052-03-05","terça-feira","Carnaval"]
["2052-04-19","sexta-feira","Paixão de Cristo"]
["2052-04-21","domingo","Tiradentes"]
["2052-05-01","quarta-feira","Dia do Trabalho"]
["2052-06-20","quinta-feira","Corpus Christi"]
["2052-09-07","sábado","Independência do Brasil"]
["2052-10-12","sábado","Nossa Sr.a Aparecida - Padroeira do Brasil"]
["2052-11-02","sábado","Finados"]
["2052-11-15","sexta-feira","Proclamação da República"]
["2052-12-25","quarta-feira","Natal"]
["2053-01-01","quarta-feira","Confraternização Universal"]
["2053-02-17","segunda-feira","Carnaval"]
["2053-02-18","terça-feira","Carnaval"]
["2053-04-04","sexta-feira","Paixão de Cristo"]
["2053-04-21","segunda-feira","Tiradentes"]
["2053-05-01","quinta-feira","Dia do Trabalho"]
["2053-06-05","quinta-feira","Corpus Christi"]
["2053-09-07","domingo","Independência do Brasil"]
["2053-10-12","domingo","Nossa Sr.a Aparecida - Padroeira do Brasil"]
["2053-11-02","domingo","Finados"]
["2053-11-15","sábado","Proclamação da República"]
["2053-12-25","quinta-feira","Natal"]
["2054-01-01","quinta-feira","Confraternização Universal"]
["2054-02-09","segunda-feira","Carnaval"]
["2054-02-10","terça-feira","Carnaval"]
["2054-03-27","sexta-feira","Paixão de Cristo"]
["2054-04-21","terça-feira","Tiradentes"]
["2054-05-01","sexta-feira","Dia do Trabalho"]
["2054-05-28","quinta-feira","Corpus Christi"]
["2054-09-07","segunda-feira","Independência do Brasil"]
["2054-10-12","segunda-feira","Nossa Sr.a Aparecida - Padroeira do Brasil"]
["2054-11-02","segunda-feira","Finados"]
["2054-11-15","domingo","Proclamação da República"]
["2054-12-25","sexta-feira","Natal"]
["2055-01-01","sexta-feira","Confraternização Universal"]
["2055-03-01","segunda-feira","Carnaval"]
["2055-03-02","terça-feira","Carnaval"]
["2055-04-16","sexta-feira","Paixão de Cristo"]
["2055-04-21","quarta-feira","Tiradentes"]
["2055-05-01","sábado","Dia do Trabalho"]
["2055-06-17","quinta-feira","Corpus Christi"]
["2055-09-07","terça-feira","Independência do Brasil"]
["2055-10-12","terça-feira","Nossa Sr.a Aparecida - Padroeira do Brasil"]
["2055-11-02","terça-feira","Finados"]
["2055-11-15","segunda-feira","Proclamação da República"]
["2055-12-25","sábado","Natal"]
["2056-01-01","sábado","Confraternização Universal"]
["2056-02-14","segunda-feira","Carnaval"]
["2056-02-15","terça-feira","Carnaval"]
["2056-03-31","sexta-feira","Paixão de Cristo"]
["2056-04-21","sexta-feira","Tiradentes"]
["2056-05-01","segunda-feira","Dia do Trabalho"]
["2056-06-01","quinta-feira","Corpus Christi"]
["2056-09-07","quinta-feira","Independência do Brasil"]
["2056-10-12","quinta-feira","Nossa Sr.a Aparecida - Padroeira do Brasil"]
["2056-11-02","quinta-feira","Finados"]
["2056-11-15","quarta-feira","Proclamação da República"]
["2056-12-25","segunda-feira","Natal"]
["2057-01-01","segunda-feira","Confraternização Universal"]
["2057-03-05","segunda-feira","Carnaval"]
["2057-03-06","terça-feira","Carnaval"]
["2057-04-20","sexta-feira","Paixão de Cristo"]
["2057-04-21","sábado","Tiradentes"]
["2057-05-01","terça-feira","Dia do Trabalho"]
["2057-06-21","quinta-feira","Corpus Christi"]
["2057-09-07","sexta-feira","Independência do Brasil"]
["2057-10-12","sexta-feira","Nossa Sr.a Aparecida - Padroeira do Brasil"]
["2057-11-02","sexta-feira","Finados"]
["2057-11-15","quinta-feira","Proclamação da República"]
["2057-12-25","terça-feira","Natal"]
["2058-01-01","terça-feira","Confraternização Universal"]
["2058-02-25","segunda-feira","Carnaval"]
["2058-02-26","terça-feira","Carnaval"]
["2058-04-12","sexta-feira","Paixão de Cristo"]
["2058-04-21","domingo","Tiradentes"]
["2058-05-01","quarta-feira","Dia do Trabalho"]
["2058-06-13","quinta-feira","Corpus Christi"]
["2058-09-07","sábado","Independência do Brasil"]
["2058-10-12","sábado","Nossa Sr.a Aparecida - Padroeira do Brasil"]
["2058-11-02","sábado","Finados"]
["2058-11-15","sexta-feira","Proclamação da República"]
["2058-12-25","quarta-feira","Natal"]
["2059-01-01","quarta-feira","Confraternização Universal"]
["2059-02-10","segunda-feira","Carnaval"]
["2059-02-11","terça-feira","Carnaval"]
["2059-03-28","sexta-feira","Paixão de Cristo"]
["2059-04-21","segunda-feira","Tiradentes"]
["2059-05-01","quinta-feira","Dia do Trabalho"]
["2059-05-29","quinta-feira","Corpus Christi"]
["2059-09-07","domingo","Independência do Brasil"]
["2059-10-12","domingo","Nossa Sr.a Aparecida - Padroeira do Brasil"]
["2059-11-02","domingo","Finados"]
["2059-11-15","sábado","Proclamação da República"]
["2059-12-25","quinta-feira","Natal"]
["2060-01-01","quinta-feira","Confraternização Universal"]
["2060-03-01","segunda-feira","Carnaval"]
["2060-03-02","terça-feira","Carnaval"]
["2060-04-16","sexta-feira","Paixão de Cristo"]
["2060-04-21","quarta-feira","Tiradentes"]
["2060-05-01","sábado","Dia do Trabalho"]
["2060-06-17","quinta-feira","Corpus Christi"]
["2060-09-07","terça-feira","Independência do Brasil"]
["2060-10-12","terça-feira","Nossa Sr.a Aparecida - Padroeira do Brasil"]
["2060-11-02","terça-feira","Finados"]
["2060-11-15","segunda-feira","Proclamação da República"]
["2060-12-25","sábado","Natal"]
["2061-01-01","sábado","Confraternização Universal"]
["2061-02-21","segunda-feira","Carnaval"]
["2061-02-22","terça-feira","Carnaval"]
["2061-04-08","sexta-feira","Paixão de Cristo"]
["2061-04-21","quinta-feira","Tiradentes"]
["2061-05-01","domingo","Dia do Trabalho"]
["2061-06-09","quinta-feira","Corpus Christi"]
["2061-09-07","quarta-feira","Independência do Brasil"]
["2061-10-12","quarta-feira","Nossa Sr.a Aparecida - Padroeira do Brasil"]
["2061-11-02","quarta-feira","Finados"]
["2061-11-15","terça-feira","Proclamação da República"]
["2061-12-25","domingo","Natal"]
["2062-01-01","domingo","Confraternização Universal"]
["2062-02-06","segunda-feira","Carnaval"]
["2062-02-07","terça-feira","Carnaval"]
["2062-03-24","sexta-feira","Paixão de Cristo"]
["2062-04-21","sexta-feira","Tiradentes"]
["2062-05-01","segunda-feira","Dia do Trabalho"]
["2062-05-25","quinta-feira","Corpus Christi"]
["2062-09-07","quinta-feira","Independência do Brasil"]
["2062-10-12","quinta-feira","Nossa Sr.a Aparecida - Padroeira do Brasil"]
["2062-11-02","quinta-feira","Finados"]
["2062-11-15","quarta-feira","Proclamação da República"]
["2062-12-25","segunda-feira","Natal"]
["2063-01-01","segunda-feira","Confraternização Universal"]
["2063-02-26","segunda-feira","Carnaval"]
["2063-02-27","terça-feira","Carnaval"]
["2063-04-13","sexta-feira","Paixão de Cristo"]
["2063-04-21","sábado","Tiradentes"]
["2063-05-01","terça-feira","Dia do Trabalho"]
["2063-06-14","quinta-feira","Corpus Christi"]
["2063-09-07","sexta-feira","Independência do Brasil"]
["2063-10-12","sexta-feira","Nossa Sr.a Aparecida - Padroeira do Brasil"]
["2063-11-02","sexta-feira","Finados"]
["2063-11-15","quinta-feira","Proclamação da República"]
["2063-12-25","terça-feira","Natal"]
["2064-01-01","terça-feira","Confraternização Universal"]
["2064-02-18","segunda-feira","Carnaval"]
["2064-02-19","terça-feira","Carnaval"]
["2064-04-04","sexta-feira","Paixão de Cristo"]
["2064-04-21","segunda-feira","Tiradentes"]
["2064-05-01","quinta-feira","Dia do Trabalho"]
["2064-06-05","quinta-feira","Corpus Christi"]
["2064-09-07","domingo","Independência do Brasil"]
["2064-10-12","domingo","Nossa Sr.a Aparecida - Padroeira do Brasil"]
["2064-11-02","domingo","Finados"]
["2064-11-15","sábado","Proclamação da República"]
["2064-12-25","quinta-feira","Natal"]
["2065-01-01","quinta-feira","Confraternização Universal"]
["2065-02-09","segunda-feira","Carnaval"]
["2065-02-10","terça-feira","Carnaval"]
["2065-03-27","sexta-feira","Paixão de Cristo"]
["2065-04-21","terça-feira","Tiradentes"]
["2065-05-01","sexta-feira","Dia do Trabalho"]
["2065-05-28","quinta-feira","Corpus Christi"]
["2065-09-07","segunda-feira","Independência do Brasil"]
["2065-10-12","segunda-feira","Nossa Sr.a Aparecida - Padroeira do Brasil"]
["2065-11-02","segunda-feira","Finados"]
["2065-11-15","domingo","Proclamação da República"]
["2065-12-25","sexta-feira","Natal"]
["2066-01-01","sexta-feira","Confraternização Universal"]
["2066-02-22","segunda-feira","Carnaval"]
["2066-02-23","terça-feira","Carnaval"]
["2066-04-09","sexta-feira","Paixão de Cristo"]
["2066-04-21","quarta-feira","Tiradentes"]
["2066-05-01","sábado","Dia do Trabalho"]
["2066-06-10","quinta-feira","Corpus Christi"]
["2066-09-07","terça-feira","Independência do Brasil"]
["2066-10-12","terça-feira","Nossa Sr.a Aparecida - Padroeira do Brasil"]
["2066-11-02","terça-feira","Finados"]
["2066-11-15","segunda-feira","Proclamação da República"]
["2066-12-25","sábado","Natal"]
["2067-01-01","sábado","Confraternização Universal"]
["2067-02-14","segunda-feira","Carnaval"]
["2067-02-15","terça-feira","Carnaval"]
["2067-04-01","sexta-feira","Paixão de Cristo"]
["2067-04-21","quinta-feira","Tiradentes"]
["2067-05-01","domingo","Dia do Trabalho"]
["2067-06-02","quinta-feira","Corpus Christi"]
["2067-09-07","quarta-feira","Independência do Brasil"]
["2067-10-12","quarta-feira","Nossa Sr.a Aparecida - Padroeira do Brasil"]
["2067-11-02","quarta-feira","Finados"]
["2067-11-15","terça-feira","Proclamação da República"]
["2067-12-25","domingo","Natal"]
["2068-01-01","domingo","Confraternização Universal"]
["2068-03-05","segunda-feira","Carnaval"]
["2068-03-06","terça-feira","Carnaval"]
["2068-04-20","sexta-feira","Paixão de Cristo"]
["2068-04-21","sábado","Tiradentes"]
["2068-05-01","terça-feira","Dia do Trabalho"]
["2068-06-21","quinta-feira","Corpus Christi"]
["2068-09-07","sexta-feira","Independência do Brasil"]
["2068-10-12","sexta-feira","Nossa Sr.a Aparecida - Padroeira do Brasil"]
["2068-11-02","sexta-feira","Finados"]
["2068-11-15","quinta-feira","Proclamação da República"]
["2068-12-25","terça-feira","Natal"]
["2069-01-01","terça-feira","Confraternização Universal"]
["2069-02-25","segunda-feira","Carnaval"]
["2069-02-26","terça-feira","Carnaval"]
["2069-04-12","sexta-feira","Paixão de Cristo"]
["2069-04-21","domingo","Tiradentes"]
["2069-05-01","quarta-feira","Dia do Trabalho"]
["2069-06-13","quinta-feira","Corpus Christi"]
["2069-09-07","sábado","Independência do Brasil"]
["2069-10-12","sábado","Nossa Sr.a Aparecida - Padroeira do Brasil"]
["2069-11-02","sábado","Finados"]
["2069-11-15","sexta-feira","Proclamação da República"]
["2069-12-25","quarta-feira","Natal"]
["2070-01-01","quarta-feira","Confraternização Universal"]
["2070-02-10","segunda-feira","Carnaval"]
["2070-02-11","terça-feira","Carnaval"]
["2070-03-28","sexta-feira","Paixão de Cristo"]
["2070-04-21","segunda-feira","Tiradentes"]
["2070-05-01","quinta-feira","Dia do Trabalho"]
["2070-05-29","quinta-feira","Corpus Christi"]
["2070-09-07","domingo","Independência do Brasil"]
["2070-10-12","domingo","Nossa Sr.a Aparecida - Padroeira do Brasil"]
["2070-11-02","domingo","Finados"]
["2070-11-15","sábado","Proclamação da República"]
["2070-12-25","quinta-feira","Natal"]
["2071-01-01","quinta-feira","Confraternização Universal"]
["2071-03-02","segunda-feira","Carnaval"]
["2071-03-03","terça-feira","Carnaval"]
["2071-04-17","sexta-feira","Paixão de Cristo"]
["2071-04-21","terça-feira","Tiradentes"]
["2071-05-01","sexta-feira","Dia do Trabalho"]
["2071-06-18","quinta-feira","Corpus Christi"]
["2071-09-07","segunda-feira","Independência do Brasil"]
["2071-10-12","segunda-feira","Nossa Sr.a Aparecida - Padroeira do Brasil"]
["2071-11-02","segunda-feira","Finados"]
["2071-11-15","domingo","Proclamação da República"]
["2071-12-25","sexta-feira","Natal"]
["2072-01-01","sexta-feira","Confraternização Universal"]
["2072-02-22","segunda-feira","Carnaval"]
["2072-02-23","terça-feira","Carnaval"]
["2072-04-08","sexta-feira","Paixão de Cristo"]
["2072-04-21","quinta-feira","Tiradentes"]
["2072-05-01","domingo","Dia do Trabalho"]
["2072-06-09","quinta-feira","Corpus Christi"]
["2072-09-07","quarta-feira","Independência do Brasil"]
["2072-10-12","quarta-feira","Nossa Sr.a Aparecida - Padroeira do Brasil"]
["2072-11-02","quarta-feira","Finados"]
["2072-11-15","terça-feira","Proclamação da República"]
["2072-12-25","domingo","Natal"]
["2073-01-01","domingo","Confraternização Universal"]
["2073-02-06","segunda-feira","Carnaval"]
["2073-02-07","terça-feira","Carnaval"]
["2073-03-24","sexta-feira","Paixão de Cristo"]
["2073-04-21","sexta-feira","Tiradentes"]
["2073-05-01","segunda-feira","Dia do Trabalho"]
["2073-05-25","quinta-feira","Corpus Christi"]
["2073-09-07","quinta-feira","Independência do Brasil"]
["2073-10-12","quinta-feira","Nossa Sr.a Aparecida - Padroeira do Brasil"]
["2073-11-02","quinta-feira","Finados"]
["2073-11-15","quarta-feira","Proclamação da República"]
["2073-12-25","segunda-feira","Natal"]
["2074-01-01","segunda-feira","Confraternização Universal"]
["2074-02-26","segunda-feira","Carnaval"]
["2074-02-27","terça-feira","Carnaval"]
["2074-04-13","sexta-feira","Paixão de Cristo"]
["2074-04-21","sábado","Tiradentes"]
["2074-05-01","terça-feira","Dia do Trabalho"]
["2074-06-14","quinta-feira","Corpus Christi"]
["2074-09-07","sexta-feira","Independência do Brasil"]
["2074-10-12","sexta-feira","Nossa Sr.a Aparecida - Padroeira do Brasil"]
["2074-11-02","sexta-feira","Finados"]
["2074-11-15","quinta-feira","Proclamação da República"]
["2074-12-25","terça-feira","Natal"]
["2075-01-01","terça-feira","Confraternização Universal"]
["2075-02-18","segunda-feira","Carnaval"]
["2075-02-19","terça-feira","Carnaval"]
["2075-04-05","sexta-feira","Paixão de Cristo"]
["2075-04-21","domingo","Tiradentes"]
["2075-05-01","quarta-feira","Dia do Trabalho"]
["2075-06-06","quinta-feira","Corpus Christi"]
["2075-09-07","sábado","Independência do Brasil"]
["2075-10-12","sábado","Nossa Sr.a Aparecida - Padroeira do Brasil"]
["2075-11-02","sábado","Finados"]
["2075-11-15","sexta-feira","Proclamação da República"]
["2075-12-25","quarta-feira","Natal"]
["2076-01-01","quarta-feira","Confraternização Universal"]
["2076-03-02","segunda-feira","Carnaval"]
["2076-03-03","terça-feira","Carnaval"]
["2076-04-17","sexta-feira","Paixão de Cristo"]
["2076-04-21","terça-feira","Tiradentes"]
["2076-05-01","sexta-feira","Dia do Trabalho"]
["2076-06-18","quinta-feira","Corpus Christi"]
["2076-09-07","segunda-feira","Independência do Brasil"]
["2076-10-12","segunda-feira","Nossa Sr.a Aparecida - Padroeira do Brasil"]
["2076-11-02","segunda-feira","Finados"]
["2076-11-15","domingo","Proclamação da República"]
["2076-12-25","sexta-feira","Natal"]
["2077-01-01","sexta-feira","Confraternização Universal"]
["2077-02-22","segunda-feira","Carnaval"]
["2077-02-23","terça-feira","Carnaval"]
["2077-04-09","sexta-feira","Paixão de Cristo"]
["2077-04-21","quarta-feira","Tiradentes"]
["2077-05-01","sábado","Dia do Trabalho"]
["2077-06-10","quinta-feira","Corpus Christi"]
["2077-09-07","terça-feira","Independência do Brasil"]
["2077-10-12","terça-feira","Nossa Sr.a Aparecida - Padroeira do Brasil"]
["2077-11-02","terça-feira","Finados"]
["2077-11-15","segunda-feira","Proclamação da República"]
["2077-12-25","sábado","Natal"]
["2078-01-01","terça-feira","Confraternização Universal"]
["2078-02-14","segunda-feira","Carnaval"]
["2078-02-15","terça-feira","Carnaval"]
["2078-04-01","sexta-feira","Paixão de Cristo"]
["2078-04-21","quinta-feira","Tiradentes"]
["2078-05-01","quarta-feira","Dia do Trabalho"]
["2078-06-02","quinta-feira","Corpus Christi"]
["2078-09-07","quarta-feira","Independência do Brasil"]
["2078-10-12","quarta-feira","Nossa Sr.a Aparecida - Padroeira do Brasil"]
["2078-11-02","quarta-feira","Finados"]
["2078-11-15","terça-feira","Proclamação da República"]
["2078-12-25","quarta-feira","Natal"]
["Fonte: ANBIMA"]