{"text_format":"1","workbook":"xlsx","n_sheets":8,"sheets":["Superfície de Vol USD Original","Superfície de Vol Dias Úteis","Smiles","ETTVol","Tabela de Feriados","Gatheral","Cupom B3","Pré B3"],"not_rendered":{"charts":6,"images":2,"macros":1,"external_links":0,"defined_names":42,"comments":0,"pivot_tables":0},"unopened":[],"bounds":{"document_bytes":16777216,"sheet_cells":100000,"rows_first":2000,"rows_last":500,"rows_between":2000,"halvings":0,"cell_chars":16384,"cell_head_chars":4096},"cells_cut":0,"cells_raw":0,"read":"whole","date_system":"1900"}

{"sheet":"Superfície de Vol USD Original","index":0,"n_rows":18,"n_cols":12,"rows_kept":18,"cut":false,"hidden":false,"merged":[]}
["2022-04-01",1,5,10,25,37,50,63,75,90,95,99]
["2022-04-01",21.55,21.432772171521901,21.241204558469061,20.138804683918394,19.666420293898874,19.196020300489888,19.198799957594808,19.027335074044231,19.456199453573987,19.522139599975748,19.560724231044578]
["2022-05-02",21.696552985298521,21.138223308912334,20.492180195218747,18.874034485428687,18.280803180485567,17.741852116665417,17.36948863077798,17.387905077926106,17.689088531889443,17.95242038171537,18.257517968380824]
["2022-06-01",22.904964833118044,22.282310513893272,21.577959069940025,19.905820907124667,18.791683036507933,18.270533313506601,17.950827579298334,17.803429450061035,18.146738565925183,18.399776135376584,18.677237378666348]
["2022-07-01",23.484727840771608,22.781931406292646,21.993213496929258,20.155907131767428,18.899147284808283,18.28885491673617,17.88878379741584,17.656790037776688,17.87769172229838,18.134999152616132,18.457785183859528]
["2022-08-01",24.072391539901989,23.279694226394874,22.402488483066463,20.426656949961199,19.062129352616338,18.394314641382746,17.965642109651288,17.704620931446065,17.933850473593591,18.228697434765422,18.607475653584743]
["2022-09-01",24.464953421490339,23.66346014453449,22.737058720712323,20.422631770829373,19.38276760125623,18.521788361084262,17.993064885792165,17.895099767889235,18.151884755049959,18.449591415752053,18.822621016068581]
["2022-10-03",24.763564960484747,23.938992878906149,22.992183006709908,20.66333730305319,19.71833466083665,18.914856557256758,18.465544701927392,18.17549719113493,18.347334440737352,18.634571384178571,19.02418069230373]
["2022-11-01",25.061483856935535,24.222917113512526,23.312334394196316,21.352986526675068,19.935471498142689,19.229658489841476,18.766477636670629,18.455551041576605,18.5773251752011,18.835717638653136,19.200470544732354]
["2022-12-01",25.040412584524518,24.31422438938738,23.420535488427362,20.834964480033669,19.75996027503837,19.051923142362924,18.59297914319729,18.294137292669681,18.457022773934778,18.752855705855325,19.160124769783806]
["2023-01-02",25.60606205210247,24.800603864029775,23.854897494246092,21.403395786767458,20.290950507625833,19.556348822425466,19.067437230873178,18.74083203199794,18.876890919818308,19.128790930865023,19.476718471723473]
["2023-03-01",25.739624475876916,24.877147307291864,23.91297995937969,21.687725553433957,20.137878908632882,19.355852303180214,18.884893504359781,18.537829747607688,18.739420587011743,19.023087955148299,19.394855792076896]
["2023-04-03",25.621875421959427,24.727661749446771,23.698893395393316,21.156832221840133,20.004060344373176,19.237108974614721,18.738027284656489,18.405164228380215,18.609459043174645,18.896642430360373,19.272937163556833]
["2023-07-03",25.797986892523301,24.917136027805302,23.878629999800911,21.160365600489875,19.951351458925309,19.140687184215558,18.664831958933853,18.314807501095174,18.57673517026759,18.888424450415982,19.281502439785243]
["2023-10-02",25.878637196609226,25.078660255220704,24.094351403867535,21.247873848404328,20.027732267406719,19.219294610077554,18.717727914375612,18.355479703345168,18.561524589873532,18.857556064658638,19.247247273137873]
{"$rows_left_out":4}
{"sheet":"Superfície de Vol Dias Úteis","index":1,"n_rows":18,"n_cols":13,"rows_kept":18,"cut":false,"hidden":false,"merged":[]}
["2022-04-01","Prazo",{"$f":"'Superfície de Vol USD Original'!B1/100","v":0.01},{"$f":"'Superfície de Vol USD Original'!C1/100","v":0.05},{"$f":"'Superfície de Vol USD Original'!D1/100","v":0.1},{"$f":"'Superfície de Vol USD Original'!E1/100","v":0.25},{"$f":"'Superfície de Vol USD Original'!F1/100","v":0.37},{"$f":"'Superfície de Vol USD Original'!G1/100","v":0.5},{"$f":"'Superfície de Vol USD Original'!H1/100","v":0.63},{"$f":"'Superfície de Vol USD Original'!I1/100","v":0.75},{"$f":"'Superfície de Vol USD Original'!J1/100","v":0.9},{"$f":"'Superfície de Vol USD Original'!K1/100","v":0.95},{"$f":"'Superfície de Vol USD Original'!L1/100","v":0.99}]
["2022-04-01",{"$f":"NETWORKDAYS($A$1,A2,'Tabela de Feriados'!$A$2:$A$937)-1","v":0},{"$f":"'Superfície de Vol USD Original'!B2/100","v":0.2155},{"$f":"'Superfície de Vol USD Original'!C2/100","v":0.21432772171521899},{"$f":"'Superfície de Vol USD Original'!D2/100","v":0.21241204558469062},{"$f":"'Superfície de Vol USD Original'!E2/100","v":0.20138804683918393},{"$f":"'Superfície de Vol USD Original'!F2/100","v":0.19666420293898873},{"$f":"'Superfície de Vol USD Original'!G2/100","v":0.19196020300489888},{"$f":"'Superfície de Vol USD Original'!H2/100","v":0.19198799957594809},{"$f":"'Superfície de Vol USD Original'!I2/100","v":0.1902733507404423},{"$f":"'Superfície de Vol USD Original'!J2/100","v":0.19456199453573986},{"$f":"'Superfície de Vol USD Original'!K2/100","v":0.19522139599975749},{"$f":"'Superfície de Vol USD Original'!L2/100","v":0.19560724231044577}]
["2022-05-02",{"$f":"NETWORKDAYS($A$1,A3,'Tabela de Feriados'!$A$2:$A$937)-1","v":19},{"$f":"'Superfície de Vol USD Original'!B3/100","v":0.2169655298529852},{"$f":"'Superfície de Vol USD Original'!C3/100","v":0.21138223308912335},{"$f":"'Superfície de Vol USD Original'!D3/100","v":0.20492180195218748},{"$f":"'Superfície de Vol USD Original'!E3/100","v":0.18874034485428687},{"$f":"'Superfície de Vol USD Original'!F3/100","v":0.18280803180485566},{"$f":"'Superfície de Vol USD Original'!G3/100","v":0.17741852116665416},{"$f":"'Superfície de Vol USD Original'!H3/100","v":0.17369488630777979},{"$f":"'Superfície de Vol USD Original'!I3/100","v":0.17387905077926105},{"$f":"'Superfície de Vol USD Original'!J3/100","v":0.17689088531889444},{"$f":"'Superfície de Vol USD Original'!K3/100","v":0.1795242038171537},{"$f":"'Superfície de Vol USD Original'!L3/100","v":0.18257517968380824}]
["2022-06-01",{"$f":"NETWORKDAYS($A$1,A4,'Tabela de Feriados'!$A$2:$A$937)-1","v":41},{"$f":"'Superfície de Vol USD Original'!B4/100","v":0.22904964833118044},{"$f":"'Superfície de Vol USD Original'!C4/100","v":0.22282310513893272},{"$f":"'Superfície de Vol USD Original'!D4/100","v":0.21577959069940025},{"$f":"'Superfície de Vol USD Original'!E4/100","v":0.19905820907124666},{"$f":"'Superfície de Vol USD Original'!F4/100","v":0.18791683036507933},{"$f":"'Superfície de Vol USD Original'!G4/100","v":0.18270533313506601},{"$f":"'Superfície de Vol USD Original'!H4/100","v":0.17950827579298334},{"$f":"'Superfície de Vol USD Original'!I4/100","v":0.17803429450061034},{"$f":"'Superfície de Vol USD Original'!J4/100","v":0.18146738565925183},{"$f":"'Superfície de Vol USD Original'!K4/100","v":0.18399776135376583},{"$f":"'Superfície de Vol USD Original'!L4/100","v":0.18677237378666348}]
["2022-07-01",{"$f":"NETWORKDAYS($A$1,A5,'Tabela de Feriados'!$A$2:$A$937)-1","v":62},{"$f":"'Superfície de Vol USD Original'!B5/100","v":0.23484727840771608},{"$f":"'Superfície de Vol USD Original'!C5/100","v":0.22781931406292646},{"$f":"'Superfície de Vol USD Original'!D5/100","v":0.21993213496929256},{"$f":"'Superfície de Vol USD Original'!E5/100","v":0.20155907131767428},{"$f":"'Superfície de Vol USD Original'!F5/100","v":0.18899147284808282},{"$f":"'Superfície de Vol USD Original'!G5/100","v":0.18288854916736169},{"$f":"'Superfície de Vol USD Original'!H5/100","v":0.17888783797415841},{"$f":"'Superfície de Vol USD Original'!I5/100","v":0.17656790037776687},{"$f":"'Superfície de Vol USD Original'!J5/100","v":0.17877691722298381},{"$f":"'Superfície de Vol USD Original'!K5/100","v":0.18134999152616132},{"$f":"'Superfície de Vol USD Original'!L5/100","v":0.18457785183859529}]
["2022-08-01",{"$f":"NETWORKDAYS($A$1,A6,'Tabela de Feriados'!$A$2:$A$937)-1","v":83},{"$f":"'Superfície de Vol USD Original'!B6/100","v":0.24072391539901988},{"$f":"'Superfície de Vol USD Original'!C6/100","v":0.23279694226394873},{"$f":"'Superfície de Vol USD Original'!D6/100","v":0.22402488483066463},{"$f":"'Superfície de Vol USD Original'!E6/100","v":0.204266569499612},{"$f":"'Superfície de Vol USD Original'!F6/100","v":0.19062129352616339},{"$f":"'Superfície de Vol USD Original'!G6/100","v":0.18394314641382745},{"$f":"'Superfície de Vol USD Original'!H6/100","v":0.17965642109651289},{"$f":"'Superfície de Vol USD Original'!I6/100","v":0.17704620931446066},{"$f":"'Superfície de Vol USD Original'!J6/100","v":0.17933850473593591},{"$f":"'Superfície de Vol USD Original'!K6/100","v":0.18228697434765423},{"$f":"'Superfície de Vol USD Original'!L6/100","v":0.18607475653584743}]
["2022-09-01",{"$f":"NETWORKDAYS($A$1,A7,'Tabela de Feriados'!$A$2:$A$937)-1","v":106},{"$f":"'Superfície de Vol USD Original'!B7/100","v":0.2446495342149034},{"$f":"'Superfície de Vol USD Original'!C7/100","v":0.2366346014453449},{"$f":"'Superfície de Vol USD Original'!D7/100","v":0.22737058720712322},{"$f":"'Superfície de Vol USD Original'!E7/100","v":0.20422631770829372},{"$f":"'Superfície de Vol USD Original'!F7/100","v":0.19382767601256229},{"$f":"'Superfície de Vol USD Original'!G7/100","v":0.18521788361084263},{"$f":"'Superfície de Vol USD Original'!H7/100","v":0.17993064885792165},{"$f":"'Superfície de Vol USD Original'!I7/100","v":0.17895099767889236},{"$f":"'Superfície de Vol USD Original'!J7/100","v":0.1815188475504996},{"$f":"'Superfície de Vol USD Original'!K7/100","v":0.18449591415752054},{"$f":"'Superfície de Vol USD Original'!L7/100","v":0.1882262101606858}]
["2022-10-03",{"$f":"NETWORKDAYS($A$1,A8,'Tabela de Feriados'!$A$2:$A$937)-1","v":127},{"$f":"'Superfície de Vol USD Original'!B8/100","v":0.24763564960484746},{"$f":"'Superfície de Vol USD Original'!C8/100","v":0.23938992878906148},{"$f":"'Superfície de Vol USD Original'!D8/100","v":0.22992183006709907},{"$f":"'Superfície de Vol USD Original'!E8/100","v":0.20663337303053189},{"$f":"'Superfície de Vol USD Original'!F8/100","v":0.19718334660836651},{"$f":"'Superfície de Vol USD Original'!G8/100","v":0.1891485655725676},{"$f":"'Superfície de Vol USD Original'!H8/100","v":0.18465544701927392},{"$f":"'Superfície de Vol USD Original'!I8/100","v":0.18175497191134929},{"$f":"'Superfície de Vol USD Original'!J8/100","v":0.18347334440737353},{"$f":"'Superfície de Vol USD Original'!K8/100","v":0.18634571384178572},{"$f":"'Superfície de Vol USD Original'!L8/100","v":0.1902418069230373}]
["2022-11-01",{"$f":"NETWORKDAYS($A$1,A9,'Tabela de Feriados'!$A$2:$A$937)-1","v":147},{"$f":"'Superfície de Vol USD Original'!B9/100","v":0.25061483856935535},{"$f":"'Superfície de Vol USD Original'!C9/100","v":0.24222917113512527},{"$f":"'Superfície de Vol USD Original'!D9/100","v":0.23312334394196316},{"$f":"'Superfície de Vol USD Original'!E9/100","v":0.21352986526675066},{"$f":"'Superfície de Vol USD Original'!F9/100","v":0.1993547149814269},{"$f":"'Superfície de Vol USD Original'!G9/100","v":0.19229658489841475},{"$f":"'Superfície de Vol USD Original'!H9/100","v":0.18766477636670628},{"$f":"'Superfície de Vol USD Original'!I9/100","v":0.18455551041576604},{"$f":"'Superfície de Vol USD Original'!J9/100","v":0.18577325175201101},{"$f":"'Superfície de Vol USD Original'!K9/100","v":0.18835717638653138},{"$f":"'Superfície de Vol USD Original'!L9/100","v":0.19200470544732354}]
["2022-12-01",{"$f":"NETWORKDAYS($A$1,A10,'Tabela de Feriados'!$A$2:$A$937)-1","v":167},{"$f":"'Superfície de Vol USD Original'!B10/100","v":0.25040412584524518},{"$f":"'Superfície de Vol USD Original'!C10/100","v":0.24314224389387382},{"$f":"'Superfície de Vol USD Original'!D10/100","v":0.23420535488427363},{"$f":"'Superfície de Vol USD Original'!E10/100","v":0.20834964480033669},{"$f":"'Superfície de Vol USD Original'!F10/100","v":0.19759960275038371},{"$f":"'Superfície de Vol USD Original'!G10/100","v":0.19051923142362923},{"$f":"'Superfície de Vol USD Original'!H10/100","v":0.18592979143197291},{"$f":"'Superfície de Vol USD Original'!I10/100","v":0.18294137292669682},{"$f":"'Superfície de Vol USD Original'!J10/100","v":0.18457022773934778},{"$f":"'Superfície de Vol USD Original'!K10/100","v":0.18752855705855326},{"$f":"'Superfície de Vol USD Original'!L10/100","v":0.19160124769783807}]
["2023-01-02",{"$f":"NETWORKDAYS($A$1,A11,'Tabela de Feriados'!$A$2:$A$937)-1","v":189},{"$f":"'Superfície de Vol USD Original'!B11/100","v":0.25606062052102468},{"$f":"'Superfície de Vol USD Original'!C11/100","v":0.24800603864029774},{"$f":"'Superfície de Vol USD Original'!D11/100","v":0.23854897494246091},{"$f":"'Superfície de Vol USD Original'!E11/100","v":0.21403395786767457},{"$f":"'Superfície de Vol USD Original'!F11/100","v":0.20290950507625832},{"$f":"'Superfície de Vol USD Original'!G11/100","v":0.19556348822425465},{"$f":"'Superfície de Vol USD Original'!H11/100","v":0.19067437230873177},{"$f":"'Superfície de Vol USD Original'!I11/100","v":0.18740832031997939},{"$f":"'Superfície de Vol USD Original'!J11/100","v":0.18876890919818309},{"$f":"'Superfície de Vol USD Original'!K11/100","v":0.19128790930865022},{"$f":"'Superfície de Vol USD Original'!L11/100","v":0.19476718471723473}]
["2023-03-01",{"$f":"NETWORKDAYS($A$1,A12,'Tabela de Feriados'!$A$2:$A$937)-1","v":229},{"$f":"'Superfície de Vol USD Original'!B12/100","v":0.25739624475876915},{"$f":"'Superfície de Vol USD Original'!C12/100","v":0.24877147307291864},{"$f":"'Superfície de Vol USD Original'!D12/100","v":0.2391297995937969},{"$f":"'Superfície de Vol USD Original'!E12/100","v":0.21687725553433956},{"$f":"'Superfície de Vol USD Original'!F12/100","v":0.20137878908632881},{"$f":"'Superfície de Vol USD Original'!G12/100","v":0.19355852303180213},{"$f":"'Superfície de Vol USD Original'!H12/100","v":0.18884893504359782},{"$f":"'Superfície de Vol USD Original'!I12/100","v":0.18537829747607687},{"$f":"'Superfície de Vol USD Original'!J12/100","v":0.18739420587011743},{"$f":"'Superfície de Vol USD Original'!K12/100","v":0.19023087955148299},{"$f":"'Superfície de Vol USD Original'!L12/100","v":0.19394855792076895}]
["2023-04-03",{"$f":"NETWORKDAYS($A$1,A13,'Tabela de Feriados'!$A$2:$A$937)-1","v":252},{"$f":"'Superfície de Vol USD Original'!B13/100","v":0.25621875421959428},{"$f":"'Superfície de Vol USD Original'!C13/100","v":0.24727661749446772},{"$f":"'Superfície de Vol USD Original'!D13/100","v":0.23698893395393317},{"$f":"'Superfície de Vol USD Original'!E13/100","v":0.21156832221840133},{"$f":"'Superfície de Vol USD Original'!F13/100","v":0.20004060344373176},{"$f":"'Superfície de Vol USD Original'!G13/100","v":0.19237108974614719},{"$f":"'Superfície de Vol USD Original'!H13/100","v":0.18738027284656489},{"$f":"'Superfície de Vol USD Original'!I13/100","v":0.18405164228380216},{"$f":"'Superfície de Vol USD Original'!J13/100","v":0.18609459043174645},{"$f":"'Superfície de Vol USD Original'!K13/100","v":0.18896642430360372},{"$f":"'Superfície de Vol USD Original'!L13/100","v":0.19272937163556833}]
["2023-07-03",{"$f":"NETWORKDAYS($A$1,A14,'Tabela de Feriados'!$A$2:$A$937)-1","v":313},{"$f":"'Superfície de Vol USD Original'!B14/100","v":0.257979868925233},{"$f":"'Superfície de Vol USD Original'!C14/100","v":0.24917136027805303},{"$f":"'Superfície de Vol USD Original'!D14/100","v":0.2387862999980091},{"$f":"'Superfície de Vol USD Original'!E14/100","v":0.21160365600489875},{"$f":"'Superfície de Vol USD Original'!F14/100","v":0.19951351458925309},{"$f":"'Superfície de Vol USD Original'!G14/100","v":0.19140687184215557},{"$f":"'Superfície de Vol USD Original'!H14/100","v":0.18664831958933853},{"$f":"'Superfície de Vol USD Original'!I14/100","v":0.18314807501095173},{"$f":"'Superfície de Vol USD Original'!J14/100","v":0.18576735170267589},{"$f":"'Superfície de Vol USD Original'!K14/100","v":0.18888424450415983},{"$f":"'Superfície de Vol USD Original'!L14/100","v":0.19281502439785242}]
["2023-10-02",{"$f":"NETWORKDAYS($A$1,A15,'Tabela de Feriados'!$A$2:$A$937)-1","v":377},{"$f":"'Superfície de Vol USD Original'!B15/100","v":0.25878637196609228},{"$f":"'Superfície de Vol USD Original'!C15/100","v":0.25078660255220703},{"$f":"'Superfície de Vol USD Original'!D15/100","v":0.24094351403867534},{"$f":"'Superfície de Vol USD Original'!E15/100","v":0.21247873848404328},{"$f":"'Superfície de Vol USD Original'!F15/100","v":0.2002773226740672},{"$f":"'Superfície de Vol USD Original'!G15/100","v":0.19219294610077553},{"$f":"'Superfície de Vol USD Original'!H15/100","v":0.18717727914375612},{"$f":"'Superfície de Vol USD Original'!I15/100","v":0.18355479703345168},{"$f":"'Superfície de Vol USD Original'!J15/100","v":0.18561524589873532},{"$f":"'Superfície de Vol USD Original'!K15/100","v":0.18857556064658637},{"$f":"'Superfície de Vol USD Original'!L15/100","v":0.19247247273137874}]
{"$rows_left_out":4}
{"sheet":"Smiles","index":2,"n_rows":14,"n_cols":2,"rows_kept":14,"cut":false,"hidden":false,"merged":[]}
["Data","2023-04-03"]
[{"$f":"\"Smile de Vol FX para \" & TEXT(B1,\"mmm/aaaa\")","v":"Smile de Vol FX para abr/2023"}]
["D","s"]
[{"$f":"TRANSPOSE('Superfície de Vol Dias Úteis'!C1:M1)","v":0.01},{"$f":"VLOOKUP($B$1,'Superfície de Vol Dias Úteis'!$A$2:$M$18,3,FALSE)","v":0.25621875421959428}]
[0.05,{"$f":"VLOOKUP($B$1,'Superfície de Vol Dias Úteis'!$A$2:$M$18,4,FALSE)","v":0.24727661749446772}]
[0.1,{"$f":"VLOOKUP($B$1,'Superfície de Vol Dias Úteis'!$A$2:$M$18,5,FALSE)","v":0.23698893395393317}]
[0.25,{"$f":"VLOOKUP($B$1,'Superfície de Vol Dias Úteis'!$A$2:$M$18,6,FALSE)","v":0.21156832221840133}]
[0.37,{"$f":"VLOOKUP($B$1,'Superfície de Vol Dias Úteis'!$A$2:$M$18,7,FALSE)","v":0.20004060344373176}]
[0.5,{"$f":"VLOOKUP($B$1,'Superfície de Vol Dias Úteis'!$A$2:$M$18,8,FALSE)","v":0.19237108974614719}]
[0.63,{"$f":"VLOOKUP($B$1,'Superfície de Vol Dias Úteis'!$A$2:$M$18,9,FALSE)","v":0.18738027284656489}]
[0.75,{"$f":"VLOOKUP($B$1,'Superfície de Vol Dias Úteis'!$A$2:$M$18,10,FALSE)","v":0.18405164228380216}]
[0.9,{"$f":"VLOOKUP($B$1,'Superfície de Vol Dias Úteis'!$A$2:$M$18,11,FALSE)","v":0.18609459043174645}]
[0.95,{"$f":"VLOOKUP($B$1,'Superfície de Vol Dias Úteis'!$A$2:$M$18,12,FALSE)","v":0.18896642430360372}]
[0.99,{"$f":"VLOOKUP($B$1,'Superfície de Vol Dias Úteis'!$A$2:$M$18,13,FALSE)","v":0.19272937163556833}]

{"sheet":"ETTVol","index":3,"n_rows":20,"n_cols":2,"rows_kept":20,"cut":false,"hidden":false,"merged":[]}
["D",0.5]
[{"$f":"\"ETT de Vol FX para Delta=\" &B1","v":"ETT de Vol FX para Delta=0,5"}]
["Vencimento","s"]
[{"$f":"'Superfície de Vol Dias Úteis'!A2","v":"2022-04-01"},{"$f":"VLOOKUP(A4,'Superfície de Vol Dias Úteis'!$A$2:$M$18,MATCH($B$1,'Superfície de Vol Dias Úteis'!$C$1:$M$1)+2,FALSE)","v":0.19196020300489888}]
[{"$f":"'Superfície de Vol Dias Úteis'!A3","v":"2022-05-02"},{"$f":"VLOOKUP(A5,'Superfície de Vol Dias Úteis'!$A$2:$M$18,MATCH($B$1,'Superfície de Vol Dias Úteis'!$C$1:$M$1)+2,FALSE)","v":0.17741852116665416}]
[{"$f":"'Superfície de Vol Dias Úteis'!A4","v":"2022-06-01"},{"$f":"VLOOKUP(A6,'Superfície de Vol Dias Úteis'!$A$2:$M$18,MATCH($B$1,'Superfície de Vol Dias Úteis'!$C$1:$M$1)+2,FALSE)","v":0.18270533313506601}]
[{"$f":"'Superfície de Vol Dias Úteis'!A5","v":"2022-07-01"},{"$f":"VLOOKUP(A7,'Superfície de Vol Dias Úteis'!$A$2:$M$18,MATCH($B$1,'Superfície de Vol Dias Úteis'!$C$1:$M$1)+2,FALSE)","v":0.18288854916736169}]
[{"$f":"'Superfície de Vol Dias Úteis'!A6","v":"2022-08-01"},{"$f":"VLOOKUP(A8,'Superfície de Vol Dias Úteis'!$A$2:$M$18,MATCH($B$1,'Superfície de Vol Dias Úteis'!$C$1:$M$1)+2,FALSE)","v":0.18394314641382745}]
[{"$f":"'Superfície de Vol Dias Úteis'!A7","v":"2022-09-01"},{"$f":"VLOOKUP(A9,'Superfície de Vol Dias Úteis'!$A$2:$M$18,MATCH($B$1,'Superfície de Vol Dias Úteis'!$C$1:$M$1)+2,FALSE)","v":0.18521788361084263}]
[{"$f":"'Superfície de Vol Dias Úteis'!A8","v":"2022-10-03"},{"$f":"VLOOKUP(A10,'Superfície de Vol Dias Úteis'!$A$2:$M$18,MATCH($B$1,'Superfície de Vol Dias Úteis'!$C$1:$M$1)+2,FALSE)","v":0.1891485655725676}]
[{"$f":"'Superfície de Vol Dias Úteis'!A9","v":"2022-11-01"},{"$f":"VLOOKUP(A11,'Superfície de Vol Dias Úteis'!$A$2:$M$18,MATCH($B$1,'Superfície de Vol Dias Úteis'!$C$1:$M$1)+2,FALSE)","v":0.19229658489841475}]
[{"$f":"'Superfície de Vol Dias Úteis'!A10","v":"2022-12-01"},{"$f":"VLOOKUP(A12,'Superfície de Vol Dias Úteis'!$A$2:$M$18,MATCH($B$1,'Superfície de Vol Dias Úteis'!$C$1:$M$1)+2,FALSE)","v":0.19051923142362923}]
[{"$f":"'Superfície de Vol Dias Úteis'!A11","v":"2023-01-02"},{"$f":"VLOOKUP(A13,'Superfície de Vol Dias Úteis'!$A$2:$M$18,MATCH($B$1,'Superfície de Vol Dias Úteis'!$C$1:$M$1)+2,FALSE)","v":0.19556348822425465}]
[{"$f":"'Superfície de Vol Dias Úteis'!A12","v":"2023-03-01"},{"$f":"VLOOKUP(A14,'Superfície de Vol Dias Úteis'!$A$2:$M$18,MATCH($B$1,'Superfície de Vol Dias Úteis'!$C$1:$M$1)+2,FALSE)","v":0.19355852303180213}]
[{"$f":"'Superfície de Vol Dias Úteis'!A13","v":"2023-04-03"},{"$f":"VLOOKUP(A15,'Superfície de Vol Dias Úteis'!$A$2:$M$18,MATCH($B$1,'Superfície de Vol Dias Úteis'!$C$1:$M$1)+2,FALSE)","v":0.19237108974614719}]
{"$rows_left_out":6}
{"sheet":"Tabela de Feriados","index":4,"n_rows":946,"n_cols":3,"rows_kept":946,"cut":false,"hidden":false,"merged":[]}
["Data","Dia da Semana","Feriado"]
["2001-01-01","segunda-feira","Confraternização Universal"]
["2001-02-26","segunda-feira","Carnaval"]
["2001-02-27","terça-feira","Carnaval"]
["2001-04-13","sexta-feira","Paixão de Cristo"]
["2001-04-21","sábado","Tiradentes"]
["2001-05-01","terça-feira","Dia do Trabalho"]
["2001-06-14","quinta-feira","Corpus Christi"]
["2001-09-07","sexta-feira","Independência do Brasil"]
["2001-10-12","sexta-feira","Nossa Sr.a Aparecida - Padroeira do Brasil"]
["2001-11-02","sexta-feira","Finados"]
["2001-11-15","quinta-feira","Proclamação da República"]
["2001-12-25","terça-feira","Natal"]
["2002-01-01","terça-feira","Confraternização Universal"]
["2002-02-11","segunda-feira","Carnaval"]
{"$rows_left_out":932}
{"sheet":"Gatheral","index":5,"n_rows":37,"n_cols":9,"rows_kept":37,"cut":false,"hidden":false,"merged":[]}
["Data","2024-07-01"]
[{"$f":"\"Smile de Vol FX para \" & TEXT(B1,\"mmm/aaaa\")","v":"Smile de Vol FX para jul/2024"}]
["a",3.4031486015094557E-2]
["b",2.4586389230004453E-2]
["r",-0.65459987764234295]
["s",4.3847422400224389E-4]
["m",0.17142598273902745]
["b(1+|r|)T",{"$f":"B4*(1+ABS(B5))*B11/252","v":9.072427688784683E-2}]
["S",4.66]
["DC",{"$f":"VLOOKUP(B1,'Superfície de Vol Dias Úteis'!$A$2:$M$18,1,FALSE)-'Superfície de Vol Dias Úteis'!$A$1","v":822}]
["DU",{"$f":"VLOOKUP(B1,'Superfície de Vol Dias Úteis'!$A$2:$M$18,2,FALSE)","v":562}]
["Taxa Pré",{"$f":"InterpolaPre(B11)","v":0.11430000000000007}]
["Cupom Cambial",{"$f":"InterpolaCupom(B10)","v":3.1199999999999988E-2}]
["r1",{"$f":"LN(1+B12)","v":0.10822640507087125},"Taxa Contínua"]
["r2",{"$f":"252/B11*LN(1+B13*B10/360)","v":3.085738026917749E-2},"Taxa Contínua"]
{"$rows_left_out":23}
{"sheet":"Cupom B3","index":6,"n_rows":270,"n_cols":2,"rows_kept":270,"cut":false,"hidden":false,"merged":[]}
["Hoje","2022-04-01"]
[]
["Dias Corridos","Cupom Cambial"]
[3,-0.7984]
[7,-0.25700000000000001]
[12,-0.11259999999999999]
[13,-9.2499999999999999E-2]
[17,-6.1900000000000004E-2]
[21,-2.8799999999999999E-2]
[27,-2.0000000000000001E-4]
[28,5.1999999999999998E-3]
[31,9.4999999999999998E-3]
[33,9.7000000000000003E-3]
[45,9.4999999999999998E-3]
[49,9.8999999999999991E-3]
{"$rows_left_out":256}
{"sheet":"Pré B3","index":7,"n_rows":270,"n_cols":3,"rows_kept":270,"cut":false,"hidden":false,"merged":[]}
["Hoje","2022-04-01"]
[]
["Dias Corridos","Dias Úteis","Taxa Pré"]
[3,{"$f":"NETWORKDAYS($B$1,$B$1+A4,'Tabela de Feriados'!$A$2:$A$937)-1","v":1},0.11650000000000001]
[7,{"$f":"NETWORKDAYS($B$1,$B$1+A5,'Tabela de Feriados'!$A$2:$A$937)-1","v":5},0.11650000000000001]
[12,{"$f":"NETWORKDAYS($B$1,$B$1+A6,'Tabela de Feriados'!$A$2:$A$937)-1","v":8},0.11650000000000001]
[13,{"$f":"NETWORKDAYS($B$1,$B$1+A7,'Tabela de Feriados'!$A$2:$A$937)-1","v":9},0.11650000000000001]
[17,{"$f":"NETWORKDAYS($B$1,$B$1+A8,'Tabela de Feriados'!$A$2:$A$937)-1","v":10},0.11650000000000001]
[21,{"$f":"NETWORKDAYS($B$1,$B$1+A9,'Tabela de Feriados'!$A$2:$A$937)-1","v":13},0.11650000000000001]
[27,{"$f":"NETWORKDAYS($B$1,$B$1+A10,'Tabela de Feriados'!$A$2:$A$937)-1","v":17},0.11650000000000001]
[28,{"$f":"NETWORKDAYS($B$1,$B$1+A11,'Tabela de Feriados'!$A$2:$A$937)-1","v":18},0.11650000000000001]
[31,{"$f":"NETWORKDAYS($B$1,$B$1+A12,'Tabela de Feriados'!$A$2:$A$937)-1","v":19},0.11650000000000001]
[33,{"$f":"NETWORKDAYS($B$1,$B$1+A13,'Tabela de Feriados'!$A$2:$A$937)-1","v":21},0.1173]
[45,{"$f":"NETWORKDAYS($B$1,$B$1+A14,'Tabela de Feriados'!$A$2:$A$937)-1","v":29},0.1193]
[49,{"$f":"NETWORKDAYS($B$1,$B$1+A15,'Tabela de Feriados'!$A$2:$A$937)-1","v":33},0.12]
{"$rows_left_out":255}